{"text_format":"1","workbook":"xlsx","n_sheets":9,"sheets":["Contenido","Demanda Mensual SIN","Demanda Anual SIN","Demanda Mensual GCE y Panamá","Demanda Anual GCE y Panamá","Demanda Regulada y No Regulada","Mensual","Anual","Regulado y No Regulado"],"not_rendered":{"charts":0,"images":11,"macros":1,"external_links":0,"defined_names":0,"comments":0,"pivot_tables":0},"unopened":[],"bounds":{"document_bytes":16777216,"sheet_cells":100000,"rows_first":2000,"rows_last":500,"rows_between":2000,"halvings":0,"cell_chars":16384,"cell_head_chars":4096},"cells_cut":0,"cells_raw":0,"read":"whole","date_system":"1900"}

{"sheet":"Contenido","index":0,"n_rows":27,"n_cols":6,"rows_kept":27,"cut":false,"hidden":false,"merged":[[14,5,15,5],[26,5,27,5],[18,5,19,5],[20,5,21,5],[22,5,23,5],[24,5,25,5]]}
[]
[]
[]
[]
[]
[]
[]
[]
[]
[]
[]
[]
[]
[]
[null,null,null,null,null,"Tabla de Contenido"]
[]
[]
[]
[null,null,null,null,"I","Demanda Mensual de Energía Electrica (GWh)  y Potencia Máxima (MW) - Sistema Interconectado Nacional (SIN)"]
[]
{"$rows_left_out":8}
{"sheet":"Demanda Mensual SIN","index":1,"n_rows":204,"n_cols":19,"rows_kept":204,"cut":false,"hidden":false,"merged":[[1,4,1,6],[9,4,10,4],[9,5,9,7],[1,15,1,17],[9,15,10,15],[9,16,9,18]]}
[]
[]
[null,null,null,null,null,null,null,null,null,null,null,null,null,null,null,null,null,null,"Volver al inicio"]
[]
[null,null,null,null,"nf","nc","nc",null,null,null,null,null,null,null,null,"nf","nc","nc"]
[null,null,null,"SIN GRANDES CONSUMIDORES ESPECIALES NI PANAMÁ",{"$f":"+VLOOKUP($D6,Mensual!$U$2:$X$4,2,FALSE)","v":4},{"$f":"+VLOOKUP($D6,Mensual!$U$2:$X$4,3,FALSE)","v":3},{"$f":"+VLOOKUP($D6,Mensual!$U$2:$X$4,4,FALSE)","v":192},null,null,null,null,null,null,null,{"$f":"+D6","v":"SIN GRANDES CONSUMIDORES ESPECIALES NI PANAMÁ"},{"$f":"+VLOOKUP($D6,Mensual!$U$200:$X$202,2,FALSE)","v":202},{"$f":"+VLOOKUP($D6,Mensual!$U$200:$X$202,3,FALSE)","v":3},{"$f":"+VLOOKUP($D6,Mensual!$U$200:$X$202,4,FALSE)","v":192}]
[]
[]
[]
[null,null,null,null,"Histórico Demanda Energía Eléctrica (GWh)","Proyección Demanda Energía Eléctrica (GWh)",null,null,null,null,null,null,null,null,null,"Histórico Demanda Potencia Máxima (MW)","Proyección Demanda Potencia Máxima (MW)"]
[null,null,null,null,null,"Esc. Medio","Esc. Alto","Esc. Bajo",null,null,null,null,null,null,null,null,"Esc. Medio","Esc. Alto","Esc. Bajo"]
[null,null,null,"2014-01-01",5153.35684004,null,null,null,null,null,null,null,null,null,"2014-01-01",9148.4649000000009]
[null,null,null,"2014-02-01",4841.91917345,null,null,null,null,null,null,null,null,null,"2014-02-01",9229.9017000000003]
[null,null,null,"2014-03-01",5239.0203094399994,null,null,null,null,null,null,null,null,null,"2014-03-01",9066.1965]
[null,"SIN GRANDES CONSUMIDORES ESPECIALES NI PANAMÁ",null,"2014-04-01",5093.8057399299996,null,null,null,null,null,null,null,null,null,"2014-04-01",9261.4187000000002]
[null,"CON GRANDES CONSUMIDORES ESPECIALES Y PANAMÁ",null,"2014-05-01",5330.4256537699994,null,null,null,null,null,null,null,null,null,"2014-05-01",9415.5691999999999]
[null,null,null,"2014-06-01",5152.1793983999996,null,null,null,null,null,null,null,null,null,"2014-06-01",9311.5529999999999]
[null,null,null,"2014-07-01",5452.3675075900001,null,null,null,null,null,null,null,null,null,"2014-07-01",9155.8266000000003]
[null,null,null,"2014-08-01",5355.0415830100001,null,null,null,null,null,null,null,null,null,"2014-08-01",9213.5393999999997]
[null,null,null,"2014-09-01",5281.6858309515219,null,null,null,null,null,null,null,null,null,"2014-09-01",9356.2562999999991]
{"$rows_left_out":185}
{"sheet":"Demanda Anual SIN","index":2,"n_rows":51,"n_cols":19,"rows_kept":51,"cut":false,"hidden":false,"merged":[[1,4,1,6],[1,15,1,17],[9,4,10,4],[9,5,9,7],[9,15,10,15],[9,16,9,18]]}
[]
[]
[null,null,null,null,null,null,null,null,null,null,null,null,null,null,null,null,null,null,"Volver al inicio"]
[]
[null,null,null,null,"nf","nc","nc",null,null,null,null,null,null,null,null,"nf","nc","nc"]
[null,null,null,"SIN GRANDES CONSUMIDORES ESPECIALES NI PANAMÁ",{"$f":"+VLOOKUP($D6,Anual!$U$2:$X$4,2,FALSE)","v":4},{"$f":"+VLOOKUP($D6,Anual!$U$2:$X$4,3,FALSE)","v":3},{"$f":"+VLOOKUP($D6,Anual!$U$2:$X$4,4,FALSE)","v":39},null,null,null,null,null,null,null,{"$f":"+D6","v":"SIN GRANDES CONSUMIDORES ESPECIALES NI PANAMÁ"},{"$f":"+VLOOKUP($D6,Anual!$U$45:$X$47,2,FALSE)","v":47},{"$f":"+VLOOKUP($D6,Anual!$U$45:$X$47,3,FALSE)","v":3},{"$f":"+VLOOKUP($D6,Anual!$U$45:$X$47,4,FALSE)","v":39}]
[]
[]
[]
[null,null,null,null,"Histórico Demanda Energía Eléctrica (GWh)","Proyección Demanda Energía Eléctrica (GWh)",null,null,null,null,null,null,null,null,null,"Histórico Demanda Potencia Máxima (MW)","Proyección Demanda Potencia Máxima (MW)"]
[null,null,null,null,null,"Esc. Medio","Esc. Alto","Esc. Bajo",null,null,null,null,null,null,null,null,"Esc. Medio","Esc. Alto","Esc. Bajo"]
[null,null,null,1991,35597.61,null,null,null,null,null,null,null,null,null,1991,6184]
[null,null,null,1992,37355.849000000002,null,null,null,null,null,null,null,null,null,1992,6098]
[null,null,null,1993,37669.089999999997,null,null,null,null,null,null,null,null,null,1993,6455]
[null,"SIN GRANDES CONSUMIDORES ESPECIALES NI PANAMÁ",null,1994,39530.984999999993,null,null,null,null,null,null,null,null,null,1994,6896]
[null,"CON GRANDES CONSUMIDORES ESPECIALES Y PANAMÁ",null,1995,41773.97,null,null,null,null,null,null,null,null,null,1995,7130]
[null,null,null,1996,42299.785999999993,null,null,null,null,null,null,null,null,null,1996,7276]
[null,null,null,1997,43633.255270000001,null,null,null,null,null,null,null,null,null,1997,7559]
[null,null,null,1998,43733.634539999999,null,null,null,null,null,null,null,null,null,1998,7506.2]
[null,null,null,1999,41502.642630000002,null,null,null,null,null,null,null,null,null,1999,7345]
{"$rows_left_out":32}
{"sheet":"Demanda Mensual GCE y Panamá","index":3,"n_rows":205,"n_cols":19,"rows_kept":205,"cut":false,"hidden":false,"merged":[[1,4,1,6],[1,15,1,17],[9,4,9,7],[9,15,9,18]]}
[]
[]
[null,null,null,null,null,null,null,null,null,null,null,null,null,null,null,null,null,null,"Volver al inicio"]
[]
[null,null,null,null,"nf","nc","nc",null,null,null,null,null,null,null,null,"nf","nc","nc"]
[null,null,null,"GRANDES CONSUMIDORES ESPECIALES Y PANAMÁ",{"$f":"+VLOOKUP($D6,Mensual!$U$7:$X$8,2,FALSE)","v":4},{"$f":"+VLOOKUP($D6,Mensual!$U$7:$X$8,3,FALSE)","v":15},{"$f":"+VLOOKUP($D6,Mensual!$U$7:$X$8,4,FALSE)","v":192},null,null,null,null,null,null,null,{"$f":"+D6","v":"GRANDES CONSUMIDORES ESPECIALES Y PANAMÁ"},{"$f":"+VLOOKUP($D6,Mensual!$U$205:$X$206,2,FALSE)","v":202},{"$f":"+VLOOKUP($D6,Mensual!$U$205:$X$206,3,FALSE)","v":15},{"$f":"+VLOOKUP($D6,Mensual!$U$205:$X$206,4,FALSE)","v":192}]
[]
[]
[]
[null,null,null,null,"Histórico Demanda Energía Eléctrica (GWh)",null,null,null,null,null,null,null,null,null,null,"Histórico Demanda Potencia Máxima (MW)"]
[null,null,null,null,"Rubiales","Otras Ecopetrol","Drummond","Exportaciones hacia Panamá",null,null,null,null,null,null,null,"Rubiales","Otras Ecopetrol","Drummond","Exportaciones hacia Panamá"]
[null,null,null,"2014-01-01",13.532990300000002,null,null,null,null,null,null,null,null,null,"2014-01-01",69.5351]
[null,null,null,"2014-02-01",60.158946499999999,null,null,null,null,null,null,null,null,null,"2014-02-01",117.09829999999999]
[null,null,null,"2014-03-01",77.709687500000015,null,null,null,null,null,null,null,null,null,"2014-03-01",116.8035]
[null,"GRANDES CONSUMIDORES ESPECIALES Y PANAMÁ",null,"2014-04-01",75.184341779999983,null,null,null,null,null,null,null,null,null,"2014-04-01",110.5813]
[null,null,null,"2014-05-01",80.431030300000003,null,null,null,null,null,null,null,null,null,"2014-05-01",124.4308]
[null,null,null,"2014-06-01",65.895040419999987,null,null,null,null,null,null,null,null,null,"2014-06-01",115.447]
[null,null,null,"2014-07-01",61.223020900000002,null,null,null,null,null,null,null,null,null,"2014-07-01",101.1734]
[null,null,null,"2014-08-01",63.839563999999996,null,null,null,null,null,null,null,null,null,"2014-08-01",104.4606]
[null,null,null,"2014-09-01",64.088522458477769,null,null,null,null,null,null,null,null,null,"2014-09-01",101.7437]
{"$rows_left_out":186}
{"sheet":"Demanda Anual GCE y Panamá","index":4,"n_rows":29,"n_cols":19,"rows_kept":29,"cut":false,"hidden":false,"merged":[[1,4,1,6],[1,15,1,17],[9,4,9,7],[9,15,9,18]]}
[]
[]
[null,null,null,null,null,null,null,null,null,null,null,null,null,null,null,null,null,null,"Volver al inicio"]
[]
[null,null,null,null,"nf","nc","nc",null,null,null,null,null,null,null,null,"nf","nc","nc"]
[null,null,null,"GRANDES CONSUMIDORES ESPECIALES Y PANAMÁ",{"$f":"+VLOOKUP($D6,Anual!$U$7:$X$8,2,FALSE)","v":4},{"$f":"+VLOOKUP($D6,Anual!$U$7:$X$8,3,FALSE)","v":15},{"$f":"+VLOOKUP($D6,Anual!$U$7:$X$8,4,FALSE)","v":39},null,null,null,null,null,null,null,{"$f":"+D6","v":"GRANDES CONSUMIDORES ESPECIALES Y PANAMÁ"},{"$f":"+VLOOKUP($D6,Anual!$U$50:$X$51,2,FALSE)","v":47},{"$f":"+VLOOKUP($D6,Anual!$U$50:$X$51,3,FALSE)","v":15},{"$f":"+VLOOKUP($D6,Anual!$U$50:$X$51,4,FALSE)","v":39}]
[]
[]
[]
[null,null,null,null,"Histórico Demanda Energía Eléctrica (GWh)",null,null,null,null,null,null,null,null,null,null,"Histórico Demanda Potencia Máxima (MW)"]
[null,null,null,null,"Rubiales","Otras Ecopetrol","Drummond","Exportaciones hacia Panamá",null,null,null,null,null,null,null,"Rubiales","Otras Ecopetrol","Drummond","Exportaciones hacia Panamá"]
[null,"GRANDES CONSUMIDORES ESPECIALES Y PANAMÁ",null,2014,759.23368372372988,null,null,null,null,null,null,null,null,null,2014,130.2781982421875]
[null,null,null,2015,918.19110284871374,null,null,null,null,null,null,null,null,null,2015,145.45609142348988]
[null,null,null,2016,1160.3930000000018,482.11199999999997,508.72320000000002,null,null,null,null,null,null,null,2016,166.47347122771595,108,115.2]
[null,null,null,2017,1203.0973781104219,964.22399999999982,1009.1519999999999,null,null,null,null,null,null,null,2017,169.13484425175329,108,115.2]
[null,null,null,2018,1079.721462480562,964.22399999999982,1011.9167999999999,1313.383,null,null,null,null,null,null,2018,160.32478182735377,108,115.2,270]
[null,null,null,2019,875.7954764774513,964.22399999999982,1009.1519999999999,1696.433,null,null,null,null,null,null,2019,140.04328395451739,108,115.2,270]
[null,null,null,2020,652.13975544323625,1813.5359999999996,1009.1519999999999,1843.9560000000001,null,null,null,null,null,null,2020,104.80303425691932,108,115.2,270]
[null,null,null,2021,568.96946520217841,2081.12,1009.1519999999999,2127.384,null,null,null,null,null,null,2021,83.695593031795454,240,115.2,270]
[null,null,null,2022,471.83049305824051,2081.12,1011.9167999999999,2393.19,null,null,null,null,null,null,2022,71.125025792348865,240,115.2,270]
{"$rows_left_out":10}
{"sheet":"Demanda Regulada y No Regulada","index":5,"n_rows":37,"n_cols":14,"rows_kept":37,"cut":false,"hidden":false,"merged":[[36,3,48,6],[1,4,1,6],[9,4,9,6]]}
[]
[]
[null,null,null,null,null,null,null,null,null,null,null,null,null,"Volver al inicio"]
[]
[null,null,null,null,"nf","nc","nc"]
[null,null,null,"SIN GRANDES CONSUMIDORES ESPECIALES NI PANAMÁ",{"$f":"+VLOOKUP($D6,'Regulado y No Regulado'!$M$2:$P$4,2,FALSE)","v":4},{"$f":"+VLOOKUP($D6,'Regulado y No Regulado'!$M$2:$P$4,3,FALSE)","v":3},{"$f":"+VLOOKUP($D6,'Regulado y No Regulado'!$M$2:$P$4,4,FALSE)","v":24},{"$f":"+VLOOKUP($D6,'Regulado y No Regulado'!$M$2:$P$4,2,FALSE)","v":4}]
[]
[]
[]
[null,null,null,null,"Demanda EE Mensual (GWh)"]
[null,null,null,null," Total","Regulada","No Regulada"]
[null,null,null,"2015-01-01",5256.8909919112839,3562.7271104399997,1669.6199619612826]
[null,null,null,"2015-02-01",4972.1260000000002,3299.2837577011815,1672.8422422988192]
[null,null,null,"2015-03-01",5411.3630000000003,3614.1530926737619,1797.2099073262382]
[null,"SIN GRANDES CONSUMIDORES ESPECIALES NI PANAMÁ",null,"2015-04-01",5267.8124674240235,3535.4269114375497,1732.3855559864742]
[null,"CON GRANDES CONSUMIDORES ESPECIALES Y PANAMÁ",null,"2015-05-01",5433.6923766235404,3635.3553499075924,1798.3370267159482]
[null,null,null,"2015-06-01",5301.341117714418,3564.632697547936,1736.708420166482]
[null,null,null,"2015-07-01",5542.6274223385781,3728.7888541269258,1813.838568211653]
[null,null,null,"2015-08-01",5507.0216938238527,3706.1490261819367,1800.872667641916]
[null,null,null,"2015-09-01",5456.641854252438,3652.6913376138045,1803.9505166386334]
{"$rows_left_out":18}
{"sheet":"Mensual","index":6,"n_rows":393,"n_cols":24,"rows_kept":393,"cut":false,"hidden":true,"merged":[[199,8,200,8],[199,9,199,11],[1,14,1,17],[199,14,199,17],[1,2,2,2],[1,3,1,5],[1,8,2,8],[1,9,1,11],[199,2,200,2],[199,3,199,5]]}
[]
[null,null,"Histórico DEE (GWh)","Proyección Demanda EE (GWh)",null,null,null,null,"Histórico DEE (GWh)","Proyección Demanda EE (GWh)",null,null,null,null,"Proyección Demanda EE GCE (GWh)",null,null,null,null,null,null,"nf","nc","nd"]
[null,null,null,"Esc. Medio","Esc. Alto","Esc. Bajo",null,null,null,"Esc. Medio","Esc. Alto","Esc. Bajo",null,null,"Rubiales","Otras Ecopetrol","Drummond","Exportaciones hacia Panamá",null,null,"SIN GRANDES CONSUMIDORES ESPECIALES NI PANAMÁ",4,3,192]
[null,"2014-01-01",5153.35684004,null,null,null,null,"2014-01-01",5166.8898303400001,null,null,null,null,"2014-01-01",13.532990300000002,null,null,null,null,null,"CON GRANDES CONSUMIDORES ESPECIALES Y PANAMÁ",4,9,192]
[null,"2014-02-01",4841.91917345,null,null,null,null,"2014-02-01",4902.0781199499997,null,null,null,null,"2014-02-01",60.158946499999999]
[null,"2014-03-01",5239.0203094399994,null,null,null,null,"2014-03-01",5316.7299969399992,null,null,null,null,"2014-03-01",77.709687500000015]
[null,"2014-04-01",5093.8057399299996,null,null,null,null,"2014-04-01",5168.9900817099997,null,null,null,null,"2014-04-01",75.184341779999983,null,null,null,null,null,null,"nf","nc","nd"]
[null,"2014-05-01",5330.4256537699994,null,null,null,null,"2014-05-01",5410.8566840699996,null,null,null,null,"2014-05-01",80.431030300000003,null,null,null,null,null,"GRANDES CONSUMIDORES ESPECIALES Y PANAMÁ",4,15,192]
[null,"2014-06-01",5152.1793983999996,null,null,null,null,"2014-06-01",5218.0744388200001,null,null,null,null,"2014-06-01",65.895040419999987]
[null,"2014-07-01",5452.3675075900001,null,null,null,null,"2014-07-01",5513.59052849,null,null,null,null,"2014-07-01",61.223020900000002]
[null,"2014-08-01",5355.0415830100001,null,null,null,null,"2014-08-01",5418.8811470099999,null,null,null,null,"2014-08-01",63.839563999999996]
[null,"2014-09-01",5281.6858309515219,null,null,null,null,"2014-09-01",5345.77435341,null,null,null,null,"2014-09-01",64.088522458477769]
[null,"2014-10-01",5389.5860417055264,null,null,null,null,"2014-10-01",5461.2802655100004,null,null,null,null,"2014-10-01",71.694223804473879]
[null,"2014-11-01",5191.7860956033237,null,null,null,null,"2014-11-01",5250.69552105,null,null,null,null,"2014-11-01",58.909425446676089]
[null,"2014-12-01",5330.8230149158971,null,null,null,null,"2014-12-01",5397.3899052299994,null,null,null,null,"2014-12-01",66.566890314102167]
[null,"2015-01-01",5256.8909919112839,null,null,null,null,"2015-01-01",5309.6560947600001,null,null,null,null,"2015-01-01",52.765102848716083]
[null,"2015-02-01",null,4972.1260000000002,5092.1729999999998,4852.08,null,"2015-02-01",null,5043.815979036558,5163.8629790365576,4923.7699790365577,null,"2015-02-01",71.689979036557688]
[null,"2015-03-01",null,5411.3630000000003,5541.05,5281.6750000000002,null,"2015-03-01",null,5487.3791321549634,5617.0661321549633,5357.6911321549633,null,"2015-03-01",76.016132154962804]
[null,"2015-04-01",null,5267.8124674240235,5353.3779459355119,5182.4938630747056,null,"2015-04-01",null,5344.6310584184412,5430.1965369299296,5259.3124540691233,null,"2015-04-01",76.81859099441769]
[null,"2015-05-01",null,5433.6923766235404,5521.9522551148821,5345.6871461974561,null,"2015-05-01",null,5514.0810941573363,5602.340972648678,5426.075863731252,null,"2015-05-01",80.388717533796139]
{"$rows_left_out":374}
{"sheet":"Anual","index":7,"n_rows":85,"n_cols":24,"rows_kept":85,"cut":false,"hidden":true,"merged":[[44,3,44,5],[44,8,45,8],[44,9,44,11],[44,14,44,17],[1,2,2,2],[1,3,1,5],[1,8,2,8],[1,9,1,11],[1,14,1,17],[44,2,45,2]]}
[]
[null,null,"Histórico DEE (GWh)","Proyección Demanda EE (GWh)",null,null,null,null,"Histórico DEE (GWh)","Proyección Demanda EE (GWh)",null,null,null,null,"Proyección Demanda EE GCE (GWh)",null,null,null,null,null,null,"nf","nc","nd"]
[null,null,null,"Esc. Medio","Esc. Alto","Esc. Bajo",null,null,null,"Esc. Medio","Esc. Alto","Esc. Bajo",null,null,"Rubiales","Otras Ecopetrol","Drummond","Exportaciones hacia Panamá",null,null,"SIN GRANDES CONSUMIDORES ESPECIALES NI PANAMÁ",4,3,39]
[null,1991,35597.61,null,null,null,null,1991,35597.61,null,null,null,null,2014,759.23368372372988,null,null,null,null,null,"CON GRANDES CONSUMIDORES ESPECIALES Y PANAMÁ",4,9,39]
[null,1992,37355.849000000002,null,null,null,null,1992,37355.849000000002,null,null,null,null,2015,918.19110284871374]
[null,1993,37669.089999999997,null,null,null,null,1993,37669.089999999997,null,null,null,null,2016,1160.3930000000018,482.11199999999997,508.72320000000002]
[null,1994,39530.984999999993,null,null,null,null,1994,39530.984999999993,null,null,null,null,2017,1203.0973781104219,964.22399999999982,1009.1519999999999,null,null,null,null,"nf","nc","nd"]
[null,1995,41773.97,null,null,null,null,1995,41773.97,null,null,null,null,2018,1079.721462480562,964.22399999999982,1011.9167999999999,1313.383,null,null,"GRANDES CONSUMIDORES ESPECIALES Y PANAMÁ",4,15,39]
[null,1996,42299.785999999993,null,null,null,null,1996,42299.785999999993,null,null,null,null,2019,875.7954764774513,964.22399999999982,1009.1519999999999,1696.433]
[null,1997,43633.255270000001,null,null,null,null,1997,43633.255270000001,null,null,null,null,2020,652.13975544323625,1813.5359999999996,1009.1519999999999,1843.9560000000001]
[null,1998,43733.634539999999,null,null,null,null,1998,43733.634539999999,null,null,null,null,2021,568.96946520217841,2081.12,1009.1519999999999,2127.384]
[null,1999,41502.642630000002,null,null,null,null,1999,41502.642630000002,null,null,null,null,2022,471.83049305824051,2081.12,1011.9167999999999,2393.19]
[null,2000,41478.843729339991,null,null,null,null,2000,41478.843729339991,null,null,null,null,2023,383.6229425802174,2081.12,1011.9167999999999,2212.2560000000003]
[null,2001,43149.600148800011,null,null,null,null,2001,43149.600148800011,null,null,null,null,2024,312.09013488381584,2081.12,1011.9167999999999,2296.3200000000002]
[null,2002,44841.101454730022,null,null,null,null,2002,44841.101454730022,null,null,null,null,2025,259.57620697306692,2081.12,1011.9167999999999,2396.31]
[null,2003,45816.198958230001,null,null,null,null,2003,45816.198958230001,null,null,null,null,2026,213.33340375769259,2081.12,1011.9167999999999,2362.5400000000004]
[null,2004,47011.096137239998,null,null,null,null,2004,47011.096137239998,null,null,null,null,2027,174.93514814240692,2081.12,1011.9167999999999,2362.5400000000004]
[null,2005,48828.930275140017,null,null,null,null,2005,48828.930275140017,null,null,null,null,2028,143.75408785725853,2081.12,1011.9167999999999,2362.5400000000004]
[null,2006,50814.63531194003,null,null,null,null,2006,50814.63531194003,null,null,null,null,2029,118.42823149284463,2081.12,1011.9167999999999,2362.5400000000004]
[null,2007,52853.240126910001,null,null,null,null,2007,52853.240126910001]
{"$rows_left_out":66}
{"sheet":"Regulado y No Regulado","index":8,"n_rows":27,"n_cols":16,"rows_kept":27,"cut":false,"hidden":true,"merged":[[1,2,1,4],[1,7,1,9]]}
[]
[null,null,"Demanda EE Mensual (GWh)",null,null,null,null,"Demanda EE Mensual (GWh)",null,null,null,null,null,"nf","nc","nd"]
[null,null," Total","Regulada","No Regulada",null,null," Total","Regulada","No Regulada",null,null,"SIN GRANDES CONSUMIDORES ESPECIALES NI PANAMÁ",4,3,24]
[null,"2015-01-01",5256.8909919112839,3562.7271104399997,1669.6199619612826,null,"2015-01-01",5309.6560947600001,3562.7271104399997,1722.3850648099985,null,null,"CON GRANDES CONSUMIDORES ESPECIALES Y PANAMÁ",4,8,24]
[null,"2015-02-01",4972.1260000000002,3299.2837577011815,1672.8422422988192,null,"2015-02-01",5043.815979036558,3299.2837577011815,1744.5322213353766]
[null,"2015-03-01",5411.3630000000003,3614.1530926737619,1797.2099073262382,null,"2015-03-01",5487.3791321549634,3614.1530926737619,1873.2260394812015]
[null,"2015-04-01",5267.8124674240235,3535.4269114375497,1732.3855559864742,null,"2015-04-01",5344.6310584184412,3535.4269114375497,1809.2041469808914]
[null,"2015-05-01",5433.6923766235404,3635.3553499075924,1798.3370267159482,null,"2015-05-01",5514.0810941573363,3635.3553499075924,1878.7257442497439]
[null,"2015-06-01",5301.341117714418,3564.632697547936,1736.708420166482,null,"2015-06-01",5378.9582131809293,3564.632697547936,1814.3255156329933]
[null,"2015-07-01",5542.6274223385781,3728.7888541269258,1813.838568211653,null,"2015-07-01",5621.472736348388,3728.7888541269258,1892.6838822214622]
[null,"2015-08-01",5507.0216938238527,3706.1490261819367,1800.872667641916,null,"2015-08-01",5587.0013599743615,3706.1490261819367,1880.8523337924248]
[null,"2015-09-01",5456.641854252438,3652.6913376138045,1803.9505166386334,null,"2015-09-01",5535.5331557671561,3652.6913376138045,1882.8418181533516]
[null,"2015-10-01",5500.3769760121331,3680.5186341998178,1819.8583418123144,null,"2015-10-01",5580.9339051991092,3680.5186341998178,1900.4152709992914]
[null,"2015-11-01",5332.6375318376076,3589.6688412616913,1742.9686905759158,null,"2015-11-01",5412.3963776310375,3589.6688412616913,1822.7275363693461]
[null,"2015-12-01",5455.0213304671643,3738.9350310518676,1716.0862994152969,null,"2015-12-01",5539.8847586254742,3738.9350310518676,1800.9497275736067]
[null,"2016-01-01",5334.4669620470431,3618.0887379985461,1716.3782240484966,null,"2016-01-01",5518.6541484006848,3618.0887379985461,1900.5654104021387]
[null,"2016-02-01",5169.1010810935477,3479.5252425390413,1689.5758385545066,null,"2016-02-01",5332.0464155673872,3479.5252425390413,1852.5211730283459]
[null,"2016-03-01",5466.3248722253466,3703.6368014609493,1762.688070764397,null,"2016-03-01",5639.1031913971465,3703.6368014609493,1935.4663899361972]
[null,"2016-04-01",5423.3031115005624,3658.3840107671335,1764.9191007334291,null,"2016-04-01",5597.905352589396,3658.3840107671335,1939.5213418222625]
[null,"2016-05-01",5542.125764632714,3746.2949168435416,1795.8308477891728,null,"2016-05-01",5724.8426051521919,3746.2949168435416,1978.5476883086503]
{"$rows_left_out":7}