{"text_format":"1","workbook":"xlsx","n_sheets":5,"sheets":["VAL_MONTHLY_ELECTRICITY","VAL_EXPLANATORY_NOTES","VAL_LISTS","Parameters","ELEC3"],"not_rendered":{"charts":0,"images":2,"macros":0,"external_links":1,"defined_names":10,"comments":1,"pivot_tables":0},"unopened":[],"bounds":{"document_bytes":16777216,"sheet_cells":100000,"rows_first":2000,"rows_last":500,"rows_between":2000,"halvings":0,"cell_chars":16384,"cell_head_chars":4096},"cells_cut":0,"cells_raw":0,"read":"whole","date_system":"1900"}

{"sheet":"VAL_MONTHLY_ELECTRICITY","index":0,"n_rows":36,"n_cols":41,"rows_kept":36,"cut":false,"hidden":false,"merged":[[1,37,1,39],[2,4,2,5],[2,7,2,8],[2,10,2,11],[2,13,2,14],[2,16,2,17],[2,19,2,20],[2,22,2,23],[2,25,2,26],[2,28,2,29],[2,31,2,32],[2,34,2,35],[2,37,2,38],[1,22,1,24],[1,25,1,27],[1,28,1,30],[1,4,1,6],[1,31,1,33],[1,34,1,36],[1,7,1,9],[1,10,1,12],[1,13,1,15],[1,16,1,18],[1,19,1,21]]}
[null,null,"Monthly Electricity Statistics Questionnaire"]
[null,null,"Country:",null,"January",null,null,"February",null,null,"March",null,null,"April",null,null,"May",null,null,"June",null,null,"July",null,null,"August",null,null,"September",null,null,"October",null,null,"November",null,null,"December"]
[null,null,"Year:",2021,"Updated?",null,null,"Updated?",null,null,"Updated?",null,null,"Updated?",null,"Y","Updated?",null,"Y","Updated?",null,null,"Updated?",null,null,"Updated?",null,null,"Updated?",null,null,"Updated?",null,"Y","Updated?",null,"Y","Updated?",null,"Y"]
[null,null,null,null,"GWh","Flag","Conf","GWh","Flag","Conf","GWh","Flag","Conf","GWh","Flag","Conf","GWh","Flag","Conf","GWh","Flag","Conf","GWh","Flag","Conf","GWh","Flag","Conf","GWh","Flag","Conf","GWh","Flag","Conf","GWh","Flag","Conf","GWh","Flag","Conf"]
[null,null,"Table 1: NET ELECTRICITY PRODUCTION"]
["NELEPROD",null,1,"Total net production",{"$f":"E7+E8+E14+E18+E21+E24+E25+E26","v":5931.7578457799982},null,null,{"$f":"H7+H8+H14+H18+H21+H24+H25+H26","v":5656.7911018599925},null,null,{"$f":"K7+K8+K14+K18+K21+K24+K25+K26","v":6061.8273824500056},null,null,{"$f":"N7+N8+N14+N18+N21+N24+N25+N26","v":5826.2198452600105},null,null,{"$f":"Q7+Q8+Q14+Q18+Q21+Q24+Q25+Q26","v":5997.7920093499924},null,null,{"$f":"T7+T8+T14+T18+T21+T24+T25+T26","v":0},null,null,{"$f":"W7+W8+W14+W18+W21+W24+W25+W26","v":0},null,null,{"$f":"Z7+Z8+Z14+Z18+Z21+Z24+Z25+Z26","v":0},null,null,{"$f":"AC7+AC8+AC14+AC18+AC21+AC24+AC25+AC26","v":0},null,null,{"$f":"AF7+AF8+AF14+AF18+AF21+AF24+AF25+AF26","v":0},null,null,{"$f":"AI7+AI8+AI14+AI18+AI21+AI24+AI25+AI26","v":0},null,null,{"$f":"AL7+AL8+AL14+AL18+AL21+AL24+AL25+AL26","v":0},null,null,"Total net production"]
["NUCLEAR",null,2,"Nuclear",0,null,null,0,null,null,0,null,null,0,null,null,0,null,null,0,null,null,0,null,null,0,null,null,0,null,null,0,null,null,0,null,null,null,null,null,"Nuclear"]
["COMBFUEL",null,3,"Conventional thermal",{"$f":"+SUM(E9:E13)","v":1311.8656015199988},null,null,{"$f":"+SUM(H9:H13)","v":1620.0428926899992},null,null,{"$f":"+SUM(K9:K13)","v":1189.1964084800002},null,null,{"$f":"+SUM(N9:N13)","v":1017.8605151199991},null,null,{"$f":"+SUM(Q9:Q13)","v":814.79172453000012},null,null,{"$f":"+SUM(T9:T13)","v":0},null,null,{"$f":"+SUM(W9:W13)","v":0},null,null,{"$f":"+SUM(Z9:Z13)","v":0},null,null,{"$f":"+SUM(AC9:AC13)","v":0},null,null,{"$f":"+SUM(AF9:AF13)","v":0},null,null,{"$f":"+SUM(AI9:AI13)","v":0},null,null,{"$f":"+SUM(AL9:AL13)","v":0},null,null,"Conventional thermal"]
["COAL",null,3.1,"Coal",512.43129035000004,null,null,817.83446295999977,null,null,426.1470518600002,null,null,358.67223851000006,null,null,232.41575035999995,null,null,null,null,null,null,null,null,null,null,null,null,null,null,null,null,null,null,null,null,null,null,null,"Coal"]
["OIL",null,3.2,"Oil",3.3603869999999998,null,null,0.38403704999999994,null,null,0.56490576999999997,null,null,1.8555671499999999,null,null,0,null,null,null,null,null,null,null,null,null,null,null,null,null,null,null,null,null,null,null,null,null,null,null,"Oil"]
{"$rows_left_out":27}
{"sheet":"VAL_EXPLANATORY_NOTES","index":1,"n_rows":71,"n_cols":3,"rows_kept":71,"cut":false,"hidden":false,"merged":[[0,1,0,2],[1,1,1,2]]}
[]
[null,"Monthly Electricity Statistics Questionnaire - Explanatory notes"]
[]
[null,"Instructions:"]
[null,1,"Sheet setup"]
[null,"1.a","Select country first, then the year."]
[null,"1.b","There is an event macro to safeguard against the deletion of any data when you change the year. If you choose to save your data under a different filename and restart the questionnaire on your own, you can use the \"Clear Questionnaire\" button."]
[null,"1.c","Please change the attribute \"Updated?\" to \"Y\" for the months for which you enter or revise data (reference months, previous months). The cell names for the updated months become \"green highlighted\"."]
[null,"1.d","Reporting countries can edit cells highlighted in yellow, other cells are locked."]
[null,"1.e","Some cells have conditional formatting and turn red if basic relationships are not respected. Please try to correct those before data transmission to Eurostat and the IEA."]
{"$rows_left_out":62}
{"sheet":"VAL_LISTS","index":2,"n_rows":53,"n_cols":13,"rows_kept":53,"cut":false,"hidden":false,"merged":[[0,0,0,14]]}
["Values for drop-down lists.\nPLEASE DO NOT MODIFY THIS SHEET."]
[2014,null,"Albania","AL",null,null,"normal value",null,null,"Not updated",null,null,"Not confidential"]
[2015,null,"Australia","AU",null,"O","missing value",null,"Y","Updated",null,"C","Confidential statistical information"]
[2016,null,"Austria","AT",null,"N","not significant"]
[2017,null,"Belarus","BY",null,"E","estimated value"]
[2018,null,"Belgium","BE",null,"U","low reliability"]
[2019,null,"Bosnia and Herzegovina","BA",null,"D","definition differs"]
[2020,null,"Bulgaria","BG"]
[2021,null,"Canada","CA"]
[2022,null,"Chile","CL"]
{"$rows_left_out":44}
{"sheet":"Parameters","index":3,"n_rows":22,"n_cols":7,"rows_kept":22,"cut":false,"hidden":false,"merged":[]}
["Element","Type","PosType","Position",null,"DataStart","H10"]
["QUEST_SOURCE","DIM","FIX","M_ELECT",null,"MaxEmptyRows",100]
["FREQ","DIM","FIX","M",null,"MaxEmptyColumns",100]
["REF_AREA","DIM","CELL","B2"]
["ENERGY_PRODUCT","DIM","FIX","E7000"]
["MAIN_FLOW","DIM","COLUMN",3]
["FLOW_BREAKDOWN","DIM","COLUMN",4]
["PLANT_TECH","DIM","COLUMN",5]
["PLANT_TYPE","DIM","FIX","_T"]
["STOCKS","DIM","FIX","_Z"]
{"$rows_left_out":13}
{"sheet":"ELEC3","index":4,"n_rows":37,"n_cols":43,"rows_kept":37,"cut":false,"hidden":false,"merged":[[0,0,0,13]]}
["Input for SDMX converter.\nPLEASE DO NOT MODIFY THIS SHEET."]
["REF_AREA ",{"$f":"VLOOKUP(VAL_MONTHLY_ELECTRICITY!D2,VAL_LISTS!C2:D53,2)","v":{"$error":"#N/A"}}]
["YEAR",{"$f":"VAL_MONTHLY_ELECTRICITY!D3","v":2021}]
[]
[]
[]
[null,null,null,null,null,null,null,{"$f":"VAL_MONTHLY_ELECTRICITY!D3&\"-01\"","v":"2021-01"},null,null,{"$f":"VAL_MONTHLY_ELECTRICITY!D3&\"-02\"","v":"2021-02"},null,null,{"$f":"VAL_MONTHLY_ELECTRICITY!D3&\"-03\"","v":"2021-03"},null,null,{"$f":"VAL_MONTHLY_ELECTRICITY!D3&\"-04\"","v":"2021-04"},null,null,{"$f":"VAL_MONTHLY_ELECTRICITY!D3&\"-05\"","v":"2021-05"},null,null,{"$f":"VAL_MONTHLY_ELECTRICITY!D3&\"-06\"","v":"2021-06"},null,null,{"$f":"VAL_MONTHLY_ELECTRICITY!D3&\"-07\"","v":"2021-07"},null,null,{"$f":"VAL_MONTHLY_ELECTRICITY!D3&\"-08\"","v":"2021-08"},null,null,{"$f":"VAL_MONTHLY_ELECTRICITY!D3&\"-09\"","v":"2021-09"},null,null,{"$f":"VAL_MONTHLY_ELECTRICITY!D3&\"-10\"","v":"2021-10"},null,null,{"$f":"VAL_MONTHLY_ELECTRICITY!D3&\"-11\"","v":"2021-11"},null,null,{"$f":"VAL_MONTHLY_ELECTRICITY!D3&\"-12\"","v":"2021-12"}]
[null,null,null,null,null,null,null,"January",null,null,"February",null,null,"March",null,null,"April",null,null,"May",null,null,"June",null,null,"July",null,null,"August",null,null,"September",null,null,"October",null,null,"November",null,null,"December"]
[null,null,"MAIN_FLOW","FLOW_BREAKDOWN","PLANT_TECH","VIS_A_VIS_AREA",null,"Value","Flag","Conf","Value","Flag","Conf","Value","Flag","Conf","Value","Flag","Conf","Value","Flag","Conf","Value","Flag","Conf","Value","Flag","Conf","Value","Flag","Conf","Value","Flag","Conf","Value","Flag","Conf","Value","Flag","Conf","Value","Flag","Conf"]
[null,null,"NETPROD","_Z","_T","_Z","Total net production",{"$f":"IF(VAL_MONTHLY_ELECTRICITY!G$3=\"Y\",ROUND(VAL_MONTHLY_ELECTRICITY!E6,3),\"\")","v":""},{"$f":"IF(VAL_MONTHLY_ELECTRICITY!G$3=\"Y\",IF(VAL_MONTHLY_ELECTRICITY!F6=\"\",\"A\",VAL_MONTHLY_ELECTRICITY!F6),\"\")","v":""},{"$f":"IF(VAL_MONTHLY_ELECTRICITY!G$3=\"Y\",IF(VAL_MONTHLY_ELECTRICITY!G6=\"\",\"F\",VAL_MONTHLY_ELECTRICITY!G6),\"\")","v":""},{"$f":"IF(VAL_MONTHLY_ELECTRICITY!J$3=\"Y\",ROUND(VAL_MONTHLY_ELECTRICITY!H6,3),\"\")","v":""},{"$f":"IF(VAL_MONTHLY_ELECTRICITY!J$3=\"Y\",IF(VAL_MONTHLY_ELECTRICITY!I6=\"\",\"A\",VAL_MONTHLY_ELECTRICITY!I6),\"\")","v":""},{"$f":"IF(VAL_MONTHLY_ELECTRICITY!J$3=\"Y\",IF(VAL_MONTHLY_ELECTRICITY!J6=\"\",\"F\",VAL_MONTHLY_ELECTRICITY!J6),\"\")","v":""},{"$f":"IF(VAL_MONTHLY_ELECTRICITY!M$3=\"Y\",ROUND(VAL_MONTHLY_ELECTRICITY!K6,3),\"\")","v":""},{"$f":"IF(VAL_MONTHLY_ELECTRICITY!M$3=\"Y\",IF(VAL_MONTHLY_ELECTRICITY!L6=\"\",\"A\",VAL_MONTHLY_ELECTRICITY!L6),\"\")","v":""},{"$f":"IF(VAL_MONTHLY_ELECTRICITY!M$3=\"Y\",IF(VAL_MONTHLY_ELECTRICITY!M6=\"\",\"F\",VAL_MONTHLY_ELECTRICITY!M6),\"\")","v":""},{"$f":"IF(VAL_MONTHLY_ELECTRICITY!P$3=\"Y\",ROUND(VAL_MONTHLY_ELECTRICITY!N6,3),\"\")","v":5826.22},{"$f":"IF(VAL_MONTHLY_ELECTRICITY!P$3=\"Y\",IF(VAL_MONTHLY_ELECTRICITY!O6=\"\",\"A\",VAL_MONTHLY_ELECTRICITY!O6),\"\")","v":"A"},{"$f":"IF(VAL_MONTHLY_ELECTRICITY!P$3=\"Y\",IF(VAL_MONTHLY_ELECTRICITY!P6=\"\",\"F\",VAL_MONTHLY_ELECTRICITY!P6),\"\")","v":"F"},{"$f":"IF(VAL_MONTHLY_ELECTRICITY!S$3=\"Y\",ROUND(VAL_MONTHLY_ELECTRICITY!Q6,3),\"\")","v":5997.7920000000004},{"$f":"IF(VAL_MONTHLY_ELECTRICITY!S$3=\"Y\",IF(VAL_MONTHLY_ELECTRICITY!R6=\"\",\"A\",VAL_MONTHLY_ELECTRICITY!R6),\"\")","v":"A"},{"$f":"IF(VAL_MONTHLY_ELECTRICITY!S$3=\"Y\",IF(VAL_MONTHLY_ELECTRICITY!S6=\"\",\"F\",VAL_MONTHLY_ELECTRICITY!S6),\"\")","v":"F"},{"$f":"IF(VAL_MONTHLY_ELECTRICITY!V$3=\"Y\",ROUND(VAL_MONTHLY_ELECTRICITY!T6,3),\"\")","v":""},{"$f":"IF(VAL_MONTHLY_ELECTRICITY!V$3=\"Y\",IF(VAL_MONTHLY_ELECTRICITY!U6=\"\",\"A\",VAL_MONTHLY_ELECTRICITY!U6),\"\")","v":""},{"$f":"IF(VAL_MONTHLY_ELECTRICITY!V$3=\"Y\",IF(VAL_MONTHLY_ELECTRICITY!V6=\"\",\"F\",VAL_MONTHLY_ELECTRICITY!V6),\"\")","v":""},{"$f":"IF(VAL_MONTHLY_ELECTRICITY!Y$3=\"Y\",ROUND(VAL_MONTHLY_ELECTRICITY!W6,3),\"\")","v":""},{"$f":"IF(VAL_MONTHLY_ELECTRICITY!Y$3=\"Y\",IF(VAL_MONTHLY_ELECTRICITY!X6=\"\",\"A\",VAL_MONTHLY_ELECTRICITY!X6),\"\")","v":""},{"$f":"IF(VAL_MONTHLY_ELECTRICITY!Y$3=\"Y\",IF(VAL_MONTHLY_ELECTRICITY!Y6=\"\",\"F\",VAL_MONTHLY_ELECTRICITY!Y6),\"\")","v":""},{"$f":"IF(VAL_MONTHLY_ELECTRICITY!AB$3=\"Y\",ROUND(VAL_MONTHLY_ELECTRICITY!Z6,3),\"\")","v":""},{"$f":"IF(VAL_MONTHLY_ELECTRICITY!AB$3=\"Y\",IF(VAL_MONTHLY_ELECTRICITY!AA6=\"\",\"A\",VAL_MONTHLY_ELECTRICITY!AA6),\"\")","v":""},{"$f":"IF(VAL_MONTHLY_ELECTRICITY!AB$3=\"Y\",IF(VAL_MONTHLY_ELECTRICITY!AB6=\"\",\"F\",VAL_MONTHLY_ELECTRICITY!AB6),\"\")","v":""},{"$f":"IF(VAL_MONTHLY_ELECTRICITY!AE$3=\"Y\",ROUND(VAL_MONTHLY_ELECTRICITY!AC6,3),\"\")","v":""},{"$f":"IF(VAL_MONTHLY_ELECTRICITY!AE$3=\"Y\",IF(VAL_MONTHLY_ELECTRICITY!AD6=\"\",\"A\",VAL_MONTHLY_ELECTRICITY!AD6),\"\")","v":""},{"$f":"IF(VAL_MONTHLY_ELECTRICITY!AE$3=\"Y\",IF(VAL_MONTHLY_ELECTRICITY!AE6=\"\",\"F\",VAL_MONTHLY_ELECTRICITY!AE6),\"\")","v":""},{"$f":"IF(VAL_MONTHLY_ELECTRICITY!AH$3=\"Y\",ROUND(VAL_MONTHLY_ELECTRICITY!AF6,3),\"\")","v":0},{"$f":"IF(VAL_MONTHLY_ELECTRICITY!AH$3=\"Y\",IF(VAL_MONTHLY_ELECTRICITY!AG6=\"\",\"A\",VAL_MONTHLY_ELECTRICITY!AG6),\"\")","v":"A"},{"$f":"IF(VAL_MONTHLY_ELECTRICITY!AH$3=\"Y\",IF(VAL_MONTHLY_ELECTRICITY!AH6=\"\",\"F\",VAL_MONTHLY_ELECTRICITY!AH6),\"\")","v":"F"},{"$f":"IF(VAL_MONTHLY_ELECTRICITY!AK$3=\"Y\",ROUND(VAL_MONTHLY_ELECTRICITY!AI6,3),\"\")","v":0},{"$f":"IF(VAL_MONTHLY_ELECTRICITY!AK$3=\"Y\",IF(VAL_MONTHLY_ELECTRICITY!AJ6=\"\",\"A\",VAL_MONTHLY_ELECTRICITY!AJ6),\"\")","v":"A"},{"$f":"IF(VAL_MONTHLY_ELECTRICITY!AK$3=\"Y\",IF(VAL_MONTHLY_ELECTRICITY!AK6=\"\",\"F\",VAL_MONTHLY_ELECTRICITY!AK6),\"\")","v":"F"},{"$f":"IF(VAL_MONTHLY_ELECTRICITY!AN$3=\"Y\",ROUND(VAL_MONTHLY_ELECTRICITY!AL6,3),\"\")","v":0},{"$f":"IF(VAL_MONTHLY_ELECTRICITY!AN$3=\"Y\",IF(VAL_MONTHLY_ELECTRICITY!AM6=\"\",\"A\",VAL_MONTHLY_ELECTRICITY!AM6),\"\")","v":"A"},{"$f":"IF(VAL_MONTHLY_ELECTRICITY!AN$3=\"Y\",IF(VAL_MONTHLY_ELECTRICITY!AN6=\"\",\"F\",VAL_MONTHLY_ELECTRICITY!AN6),\"\")","v":"F"}]
{"$rows_left_out":27}