{"text_format":"1","workbook":"xlsx","n_sheets":19,"sheets":["areas","barras","criterios","obras","proyectos","cortocircuito","zonas","zonaBarra","calificacionProyectos","ejecutar","ASIGNACION","RESUMEN","RESUMEN %","EXPANSION","BENEFICIO","INTERCAMBIO","PORCENTAJE BARRAS","PORCENTAJE AREAS","PORCENTAJE ZONAS"],"not_rendered":{"charts":0,"images":0,"macros":1,"external_links":1,"defined_names":6,"comments":0,"pivot_tables":0},"unopened":[],"bounds":{"document_bytes":16777216,"sheet_cells":100000,"rows_first":2000,"rows_last":500,"rows_between":2000,"halvings":0,"cell_chars":16384,"cell_head_chars":4096},"cells_cut":0,"cells_raw":0,"read":"whole","date_system":"1900"}

{"sheet":"areas","index":0,"n_rows":12,"n_cols":8,"rows_kept":12,"cut":false,"hidden":true,"merged":[]}
["nombre","periodo","limiteimportacion","limiteexportacion","demanda","generacion","factorimportacion","factorexportacion"]
["Bolivar",2023,9999999,999999,200,300,1,1]
["Bolivar",2024,9999999,999999,200,300,1,1]
["Bolivar",2025,9999999,999999,200,300,1,1]
["Bolivar",2026,9999999,999999,200,300,1,1]
["Bolivar",2027,9999999,999999,200,300,1,1]
["Bolivar",2028,9999999,999999,200,300,1,1]
["Bolivar",2029,9999999,999999,200,300,1,1]
["Bolivar",2030,9999999,999999,200,300,1,1]
["Bolivar",2031,9999999,999999,200,300,1,1]
["Bolivar",2032,9999999,999999,200,300,1,1]
["Bolivar",2033,9999999,999999,200,300,1,1]

{"sheet":"barras","index":1,"n_rows":859,"n_cols":7,"rows_kept":859,"cut":false,"hidden":false,"merged":[]}
["nombre","periodo","capacidad","cortocircuito","factorcapacidad","factorcorto","comentarios"]
["Argos 110",2023,121.2821111952575,12.962282040379851,1,1]
["Bayunca 13.8",2023,26.9140625,0.99212196415945897,1,1]
["Bayunca 34.5",2023,33.683941087596523,17.560181406834531,1,1]
["Bayunca 66",2023,104.6265789114598,16.359482161459422,1,1]
["Bgrande 66",2023,77.321769445987343,1.8544517950265309,1,1]
["Bolivar 13.8",2023,28.116811159384341,1.60547862778991,1,1]
["Bolivar 220",2023,188.90327196320101,8.3408096607946902E-2,1,1]
["Bolivar 34.5",2023,99.58984375,0.125,1,1]
["Bolivar 500",2023,856.18884541227362,23.39214033558191,1,1]
["Bolivar 66",2023,144.56947914015171,19.615988725745609,1,1]
["Bosque 220",2023,191.98929875899569,15.23384025647502,1,1]
["Bosque 3 13.8",2023,0,0.125,1,1,"No se calcula la capacidad de barra para este nodo"]
["Bosque 5 13.8",2023,0,0.125,1,1,"No se calcula la capacidad de barra para este nodo"]
["Bosque 66",2023,191.44910236717379,0.2,1,1]
["Calamar 13.8",2023,8.3684017431237123,7.5412851855361263,1,1]
["Calamar 34.5",2023,12.059966349443179,9.2509650080624901,1,1]
["Calamar 66",2023,11.91521944290615,8.1055158090277608,1,1]
["Campestre 66",2023,0,0,1,1]
["Candelaria 110",2023,123.09685681514431,22.902034463511011,1,1]
["Candelaria 13.8",2023,50,0.125,1,1]
["Candelaria 220",2023,120.20307094766341,4.5693183761875389,1,1]
["Carreto 500",2023,0,0,1,1]
["Carreto 66",2023,0,0,1,1]
["Cartagena 220",2023,112.0069696671118,0.1575,1,1]
["Cartagena 66",2023,112.68114407759199,0.1575,1,1]
["Chambacu 66",2023,113.207729626447,3.2908472052603912,1,1]
["Cospique 66",2023,63.346129873347067,0.09,1,1]
["Coveñas 110",2023,0,24.328984400176811,1,1,"No se calcula la capacidad de barra para este nodo"]
["El Carmen 110",2023,69.56126854551087,21.624264434479741,1,1]
["El Carmen 13.8",2023,0,17.200142823979299,1,1]
["El Carmen 66",2023,0,19.97274650848804,1,1]
["Gambote 66",2023,16.481656804101739,6.6625308189990884,1,1]
["La Marina 66",2023,0,0,1,1]
["Mamonal 13.8",2023,0,3.5584941484957611,1,1]
["Mamonal 66",2023,0,16.790714829664271,1,1]
["Manzanillo 13.8",2023,48.665923876436267,0.72651009320838966,1,1]
["Manzanillo 66",2023,115.32112200363829,31.986387208214719,1,1]
["Membrillal 13.8",2023,45.504140725670197,0.125,1,1]
["Membrillal 66",2023,0,2.5142185447681089,1,1]
["Nv Cospique 110",2023,122.4781085196896,27.981439169896738,1,1]
["Nv Cospique 13.8",2023,0,0.2,1,1]
["Nva Toluviejo 110",2023,0,0,1,1]
["Pasacaballos 1 13.8",2023,0,0,1,1,"No se calcula la capacidad de barra para este nodo"]
["Pasacaballos 110",2023,0,0,1,1]
["Pasacaballos 13.8",2023,0,0,1,1]
["Pasacaballos 2 13.8",2023,0,0,1,1,"No se calcula la capacidad de barra para este nodo"]
["Pasacaballos 220",2023,0,0,1,1]
["Proelectrica 66",2023,54.385278567307438,0.125,1,1]
["Sabanalarga 220",2023,0,0.2,1,1,"No se calcula la capacidad de barra para este nodo"]
["Sabanalarga 500",2023,0,17.475946600710991,1,1,"No se calcula la capacidad de barra para este nodo"]
["San Estanisiao 13.8",2023,11.05465395541813,21.2712960390215,1,1]
["San Estanislao 34.5",2023,10.543464039223579,23.67695753173145,1,1]
["San Jacinto 13.8",2023,7.0727652892029802,4.86610691186171,1,1]
["San Jacinto 34.5",2023,7.9113731664567259,22.424002888364861,1,1]
["San Jacinto 66",2023,16.730386302609531,6.7157477789793729,1,1]
["San Juan Nepomuceno 13.8",2023,7.9405835288866884,13.133731900342889,1,1]
["San Juan Nepomuceno 34.5",2023,6.9718140760051597,23.55533963152287,1,1]
["Sierra Flor 110",2023,0,21.230335594759499,1,1,"No se calcula la capacidad de barra para este nodo"]
["Ternera  13.8",2023,15.013354220858041,0.1575,1,1]
["Ternera 110",2023,65.05822713468288,20.93612586144005,1,1]
["Ternera 13.8",2023,50,0.1575,1,1]
["Ternera 2 13.8",2023,50,0.1575,1,1]
["Ternera 220",2023,0,0.1575,1,1]
["Ternera 66",2023,0,0.151,1,1]
["Toluviejo 1 13.8",2023,0,0,1,1,"No se calcula la capacidad de barra para este nodo"]
["Toluviejo 110",2023,0,22.589112832147851,1,1,"No se calcula la capacidad de barra para este nodo"]
["Toluviejo 2 13.8",2023,0,0,1,1,"No se calcula la capacidad de barra para este nodo"]
["Toluviejo 220",2023,130.77352467206131,30.042212193986881,1,1]
["Turbaco 110",2023,0,0,1,1]
["Turbaco 13.8",2023,0,0,1,1]
["Villa Estrella 13.8",2023,0,0.38542858837181981,1,1]
["Villa Estrella 66",2023,108.6352834103955,24.409827397201038,1,1]
["Zambrano 13.8",2023,12.258359245736139,16.754675790510149,1,1]
["Zambrano 34.5",2023,30.82084707498289,5.6794557339527731,1,1]
["Zambrano 66",2023,34.495563413277139,28.69451803389331,1,1]
["Zaragocilla 66",2023,120.9837312766447,7.0960865240558313,1,1]
["Argos 110",2024,133.7821111952575,10.186716582721621,1,1]
["Bayunca 13.8",2024,27.2265625,0.1107459335871006,1,1]
["Bayunca 34.5",2024,33.683941087596523,17.28433136494283,1,1]
["Bayunca 66",2024,105.4078289114598,16.029401306220159,1,1]
["Bgrande 66",2024,82.664641840374202,1.3117785970837299,1,1]
["Bolivar 13.8",2024,28.116811159384341,0.73563370973381126,1,1]
["Bolivar 220",2024,195.15327196320109,0.2,1,1]
["Bolivar 34.5",2024,99.58984375,0.125,1,1]
["Bolivar 500",2024,899.79233721670062,21.791651723556619,1,1]
["Bolivar 66",2024,146.13197914015171,18.77514981632514,1,1]
["Bosque 220",2024,204.48929875899569,14.07605311897394,1,1]
["Bosque 3 13.8",2024,0,0.125,1,1,"No se calcula la capacidad de barra para este nodo"]
["Bosque 5 13.8",2024,0,0.125,1,1,"No se calcula la capacidad de barra para este nodo"]
["Bosque 66",2024,203.94910236717379,0.2,1,1]
["Calamar 13.8",2024,8.6809017431237123,6.797138698493856,1,1]
["Calamar 34.5",2024,17.110867833494659,8.6896355215977046,1,1]
["Calamar 66",2024,18.175744130329161,7.6228448496449621,1,1]
["Campestre 66",2024,90.625,5.6300576341923474,1,1]
["Candelaria 110",2024,135.59685681514429,19.843595856244988,1,1]
["Candelaria 13.8",2024,50,0.125,1,1]
["Candelaria 220",2024,126.45307094766341,2.8980728516673011,1,1]
["Carreto 500",2024,0,0,1,1]
["Carreto 66",2024,8.203125,36.883996436826749,1,1]
["Cartagena 220",2024,118.2569696671118,0.1575,1,1]
["Cartagena 66",2024,112.68114407759199,0.1575,1,1]
["Chambacu 66",2024,89.416364813223481,3.4920058019728089,1,1]
["Cospique 66",2024,67.481887326452153,0.09,1,1]
["Coveñas 110",2024,0,23.80437576500816,1,1,"No se calcula la capacidad de barra para este nodo"]
["El Carmen 110",2024,33.69373945173183,21.421127855612891,1,1]
["El Carmen 13.8",2024,0,16.430752826122081,1,1]
["El Carmen 66",2024,0,19.691654064005139,1,1]
["Gambote 66",2024,21.95040680410175,6.5599769176507543,1,1]
["La Marina 66",2024,135.9375,10.56848587490302,1,1]
["Mamonal 13.8",2024,0,2.85336570909719,1,1]
["Mamonal 66",2024,0,16.272377181474742,1,1]
["Manzanillo 13.8",2024,48.9994429073272,0.125,1,1]
["Manzanillo 66",2024,116.10237200363829,31.68055978504211,1,1]
["Membrillal 13.8",2024,37.598655396840883,0.125,1,1]
["Membrillal 66",2024,0,1.63293223090874,1,1]
["Nv Cospique 110",2024,134.97810851968961,24.48168175876587,1,1]
["Nv Cospique 13.8",2024,0,0.2,1,1]
["Nva Toluviejo 110",2024,0,0,1,1]
["Pasacaballos 1 13.8",2024,0,0.125,1,1,"No se calcula la capacidad de barra para este nodo"]
["Pasacaballos 110",2024,97.65625,25.924473255478659,1,1]
["Pasacaballos 13.8",2024,34.6875,10.92849767127381,1,1]
["Pasacaballos 2 13.8",2024,0,0.125,1,1,"No se calcula la capacidad de barra para este nodo"]
["Pasacaballos 220",2024,0,0,1,1]
["Proelectrica 66",2024,44.612923824744392,0.125,1,1]
["Sabanalarga 220",2024,0,0.2,1,1,"No se calcula la capacidad de barra para este nodo"]
["Sabanalarga 500",2024,0,15.579760237711209,1,1,"No se calcula la capacidad de barra para este nodo"]
["San Estanisiao 13.8",2024,11.37483643022933,20.963050318618489,1,1]
["San Estanislao 34.5",2024,10.41175454042121,23.537516366391721,1,1]
["San Jacinto 13.8",2024,7.3852652892029802,4.5179712088393202,1,1]
["San Jacinto 34.5",2024,8.2238731664567268,22.255730707853491,1,1]
["San Jacinto 66",2024,19.464761302609531,6.1801290126177886,1,1]
["San Juan Nepomuceno 13.8",2024,8.2530835288866875,12.971123150530341,1,1]
["San Juan Nepomuceno 34.5",2024,7.1335239260091594,23.464798057340769,1,1]
["Sierra Flor 110",2024,0,20.429893294290121,1,1,"No se calcula la capacidad de barra para este nodo"]
["Ternera  13.8",2024,15.10880181117712,0.1575,1,1]
["Ternera 110",2024,101.85765487900851,16.63457356275789,1,1]
["Ternera 13.8",2024,50,0.1575,1,1]
["Ternera 2 13.8",2024,50,0.1575,1,1]
["Ternera 220",2024,0,0.1575,1,1]
["Ternera 66",2024,0,0.151,1,1]
["Toluviejo 1 13.8",2024,0,0,1,1,"No se calcula la capacidad de barra para este nodo"]
["Toluviejo 110",2024,0,21.305376604183859,1,1,"No se calcula la capacidad de barra para este nodo"]
["Toluviejo 2 13.8",2024,0,0,1,1,"No se calcula la capacidad de barra para este nodo"]
["Toluviejo 220",2024,124.65502473167891,29.416332305438019,1,1]
["Turbaco 110",2024,93.75,30.619694757998161,1,1]
["Turbaco 13.8",2024,50,0.125,1,1]
["Villa Estrella 13.8",2024,0,0.125,1,1]
["Villa Estrella 66",2024,108.6352834103955,24.138986469961718,1,1]
["Zambrano 13.8",2024,11.97606434001913,14.756032170835461,1,1]
["Zambrano 34.5",2024,18.61634136054661,4.7573657256467428,1,1]
["Zambrano 66",2024,19.087198996790811,27.925228163656101,1,1]
["Zaragocilla 66",2024,107.36686563832239,6.4459257721857917,1,1]
["Argos 110",2025,33.445527798814382,9.3347477163479393,1,1]
["Bayunca 13.8",2025,27.2265625,0.125,1,1]
["Bayunca 34.5",2025,26.841970543798261,14.20930311918095,1,1]
["Bayunca 66",2025,26.35195722786494,15.88644742133779,1,1]
["Bgrande 66",2025,23.236692361496839,0.82209807872419915,1,1]
["Bolivar 13.8",2025,24.05840557969217,0.41173306315711139,1,1]
["Bolivar 220",2025,24.394158995400129,0.2,1,1]
["Bolivar 34.5",2025,69.794921875,0.125,1,1]
["Bolivar 500",2025,156.18884541227371,20.209723672580601,1,1]
["Bolivar 66",2025,27.399746088778439,18.262623106659969,1,1]
["Bosque 220",2025,25.561162344874461,12.97825427862783,1,1]
["Bosque 3 13.8",2025,0,0.125,1,1,"No se calcula la capacidad de barra para este nodo"]
["Bosque 5 13.8",2025,0,0.125,1,1,"No se calcula la capacidad de barra para este nodo"]
["Bosque 66",2025,25.493637795896721,0.2,1,1]
["Calamar 13.8",2025,8.8222139449896986,6.5154927508946257,1,1]
["Calamar 34.5",2025,17.686233174721501,8.4791870056433147,1,1]
["Calamar 66",2025,19.277922221453,7.4627912442014939,1,1]
["Campestre 66",2025,22.65625,4.7815612349264072,1,1]
["Candelaria 110",2025,33.899214203786087,18.693336308290039,1,1]
["Candelaria 13.8",2025,25,0.125,1,1]
["Candelaria 220",2025,31.613267736915841,1.2455335082161409,1,1]
["Carreto 500",2025,0,0,1,1]
["Carreto 66",2025,9.5703125,36.593674835026746,1,1]
["Cartagena 220",2025,29.56424241677794,0.1575,1,1]
["Cartagena 66",2025,28.170286019397999,0.1575,1,1]
["Chambacu 66",2025,24.315293505787849,2.8552532179688188,1,1]
["Cospique 66",2025,25.554477913075608,0.09,1,1]
["Coveñas 110",2025,0,20.841155607845039,1,1,"No se calcula la capacidad de barra para este nodo"]
["El Carmen 110",2025,8.4234348629329574,20.578301249928831,1,1]
["El Carmen 13.8",2025,0,14.064408992961789,1,1]
["El Carmen 66",2025,0,18.719860542928959,1,1]
["Gambote 66",2025,22.871934291459901,6.5271014280476631,1,1]
["La Marina 66",2025,25.48828125,9.890416660608409,1,1]
["Mamonal 13.8",2025,0,2.624630209638291,1,1]
["Mamonal 66",2025,0,16.055423243288239,1,1]
["Manzanillo 13.8",2025,24.87086323634119,0.125,1,1]
["Manzanillo 66",2025,29.025593000909581,31.551153972291651,1,1]
["Membrillal 13.8",2025,23.799327698420441,0.125,1,1]
["Membrillal 66",2025,0,1.23775865035585,1,1]
["Nv Cospique 110",2025,33.744527129922403,23.48905600624456,1,1]
["Nv Cospique 13.8",2025,0,0.2,1,1]
["Nva Toluviejo 110",2025,9.375,15.45279020079564,1,1]
["Pasacaballos 1 13.8",2025,0,0.125,1,1,"No se calcula la capacidad de barra para este nodo"]
["Pasacaballos 110",2025,24.4140625,24.1193463162661,1,1]
["Pasacaballos 13.8",2025,34.6875,10.391587237403961,1,1]
["Pasacaballos 2 13.8",2025,0,0.125,1,1,"No se calcula la capacidad de barra para este nodo"]
["Pasacaballos 220",2025,0,0,1,1]
["Proelectrica 66",2025,22.898023723359021,0.125,1,1]
["Sabanalarga 220",2025,0,0.2,1,1,"No se calcula la capacidad de barra para este nodo"]
["Sabanalarga 500",2025,0,14.714570052082861,1,1,"No se calcula la capacidad de barra para este nodo"]
["San Estanisiao 13.8",2025,10.68741821511466,20.877614966493041,1,1]
["San Estanislao 34.5",2025,8.1419730294176844,23.493566113054442,1,1]
["San Jacinto 13.8",2025,7.6977652892029802,4.2446727131181872,1,1]
["San Jacinto 34.5",2025,8.2238731664567268,22.144016195368529,1,1]
["San Jacinto 66",2025,9.7323806513047657,5.7155440459787838,1,1]
["San Juan Nepomuceno 13.8",2025,8.3211997321772913,12.921334021234671,1,1]
["San Juan Nepomuceno 34.5",2025,6.8290444462548372,23.41245938188926,1,1]
["Sierra Flor 110",2025,0,15.671699406336151,1,1,"No se calcula la capacidad de barra para este nodo"]
["Ternera  13.8",2025,14.789501697978549,0.1575,1,1]
["Ternera 110",2025,31.30361928367072,17.709609784554171,1,1]
["Ternera 13.8",2025,25,0.1575,1,1]
["Ternera 2 13.8",2025,25,0.1575,1,1]
["Ternera 220",2025,0,0.1575,1,1]
["Ternera 66",2025,0,0.151,1,1]
["Toluviejo 1 13.8",2025,0,0.125,1,1,"No se calcula la capacidad de barra para este nodo"]
["Toluviejo 110",2025,0,12.172682954640729,1,1,"No se calcula la capacidad de barra para este nodo"]
["Toluviejo 2 13.8",2025,0,0.125,1,1,"No se calcula la capacidad de barra para este nodo"]
["Toluviejo 220",2025,15.58187809145986,25.217669357089431,1,1]
["Turbaco 110",2025,35.15625,30.515048738583442,1,1]
["Turbaco 13.8",2025,25,0.125,1,1]
["Villa Estrella 13.8",2025,0,0.125,1,1]
["Villa Estrella 66",2025,27.158820852598861,24.028383880852431,1,1]
["Zambrano 13.8",2025,10.988032170009561,13.73532541861694,1,1]
["Zambrano 34.5",2025,9.4239617687457233,4.3240586914553401,1,1]
["Zambrano 66",2025,9.5671289154010815,27.52245460133167,1,1]
["Zaragocilla 66",2025,27.233731276644701,6.1441456111474508,1,1]
["Argos 110",2026,33.445527798814382,7.0879726993799714,1,1]
["Bayunca 13.8",2026,27.2265625,0.125,1,1]
["Bayunca 34.5",2026,26.841970543798261,14.26648933799946,1,1]
["Bayunca 66",2026,26.35195722786494,15.93156777536826,1,1]
["Bgrande 66",2026,23.236692361496839,0.80278124466201106,1,1]
["Bolivar 13.8",2026,24.05840557969217,0.54279562305397988,1,1]
["Bolivar 220",2026,24.394158995400129,0.2,1,1]
["Bolivar 34.5",2026,69.794921875,0.125,1,1]
["Bolivar 500",2026,156.18884541227371,20.042181181896641,1,1]
["Bolivar 66",2026,27.399746088778439,18.34289990284017,1,1]
["Bosque 220",2026,25.561162344874461,12.913166936280509,1,1]
["Bosque 3 13.8",2026,0,0.125,1,1,"No se calcula la capacidad de barra para este nodo"]
["Bosque 5 13.8",2026,0,0.125,1,1,"No se calcula la capacidad de barra para este nodo"]
["Bosque 66",2026,25.493637795896721,0.2,1,1]
["Calamar 13.8",2026,9.1347139449896986,3.6159394193794809,1,1]
["Calamar 34.5",2026,18.37373317472159,5.865439433526622,1,1]
["Calamar 66",2026,51.074797221453068,4.3394490960209886,1,1]
["Campestre 66",2026,22.65625,4.3438337279307717,1,1]
["Candelaria 110",2026,33.899214203786087,15.783951692527779,1,1]
["Candelaria 13.8",2026,25,0.125,1,1]
["Candelaria 220",2026,31.613267736915841,0.92653930761701275,1,1]
["Carreto 500",2026,300,23.479652683097829,1,1]
["Carreto 66",2026,59.100151062011719,20.723916130020079,1,1]
["Cartagena 220",2026,29.56424241677794,0.1575,1,1]
["Cartagena 66",2026,28.170286019397999,0.1575,1,1]
["Chambacu 66",2026,24.315293505787849,2.8059477478898209,1,1]
["Cospique 66",2026,25.554477913075608,0.09,1,1]
["Coveñas 110",2026,0,20.879228456493991,1,1,"No se calcula la capacidad de barra para este nodo"]
["El Carmen 110",2026,14.673434862932959,19.768724224884242,1,1]
["El Carmen 13.8",2026,0,6.1688400760900599,1,1]
["El Carmen 66",2026,0,15.37273577352196,1,1]
["Gambote 66",2026,24.68478180410175,3.6346552481631669,1,1]
["La Marina 66",2026,25.48828125,9.8225360442164806,1,1]
["Mamonal 13.8",2026,0,2.6312905950200691,1,1]
["Mamonal 66",2026,0,15.98612314842069,1,1]
["Manzanillo 13.8",2026,24.87086323634119,0.125,1,1]
["Manzanillo 66",2026,29.025593000909581,31.593666426665109,1,1]
["Membrillal 13.8",2026,23.799327698420441,0.125,1,1]
["Membrillal 66",2026,0,1.085882537750962,1,1]
["Nv Cospique 110",2026,33.744527129922403,20.657397909919069,1,1]
["Nv Cospique 13.8",2026,0,0.2,1,1]
["Nva Toluviejo 110",2026,9.375,14.8531948378922,1,1]
["Pasacaballos 1 13.8",2026,0,0.125,1,1,"No se calcula la capacidad de barra para este nodo"]
["Pasacaballos 110",2026,24.4140625,14.6749161849697,1,1]
["Pasacaballos 13.8",2026,34.6875,9.5162049147483696,1,1]
["Pasacaballos 2 13.8",2026,0,0.125,1,1,"No se calcula la capacidad de barra para este nodo"]
["Pasacaballos 220",2026,25,22.71158443371359,1,1]
["Proelectrica 66",2026,22.898023723359021,0.125,1,1]
["Sabanalarga 220",2026,0,0.2,1,1,"No se calcula la capacidad de barra para este nodo"]
["Sabanalarga 500",2026,0,14.05826740843723,1,1,"No se calcula la capacidad de barra para este nodo"]
["San Estanisiao 13.8",2026,12.24991821511466,19.623218259296689,1,1]
["San Estanislao 34.5",2026,12.204473029417681,22.446312840579061,1,1]
["San Jacinto 13.8",2026,8.0102652892029802,3.717715818403208,1,1]
["San Jacinto 34.5",2026,8.9377966270774891,22.015652598249069,1,1]
["San Jacinto 66",2026,19.765001766032739,2.6330503998274861,1,1]
["San Juan Nepomuceno 13.8",2026,8.6336997321772913,13.11897519916235,1,1]
["San Juan Nepomuceno 34.5",2026,7.1415444462548372,23.394959665655641,1,1]
["Sierra Flor 110",2026,0,15.56793694788181,1,1,"No se calcula la capacidad de barra para este nodo"]
["Ternera  13.8",2026,15.102001697978549,0.1575,1,1]
["Ternera 110",2026,31.30361928367072,16.132121140495169,1,1]
["Ternera 13.8",2026,25,0.1575,1,1]
["Ternera 2 13.8",2026,25,0.1575,1,1]
["Ternera 220",2026,0,0.1575,1,1]
["Ternera 66",2026,0,0.151,1,1]
["Toluviejo 1 13.8",2026,0,0.125,1,1,"No se calcula la capacidad de barra para este nodo"]
["Toluviejo 110",2026,0,11.92633597417591,1,1,"No se calcula la capacidad de barra para este nodo"]
["Toluviejo 2 13.8",2026,0,0.125,1,1,"No se calcula la capacidad de barra para este nodo"]
["Toluviejo 220",2026,15.58187809145986,25.185100130611659,1,1]
["Turbaco 110",2026,35.15625,27.972790119962649,1,1]
["Turbaco 13.8",2026,25,0.125,1,1]
["Villa Estrella 13.8",2026,0,0.125,1,1]
["Villa Estrella 66",2026,27.158820852598861,24.0669634170942,1,1]
["Zambrano 13.8",2026,13.175532170009561,10.64882776598937,1,1]
["Zambrano 34.5",2026,19.42396176874572,3.245183934406624,1,1]
["Zambrano 66",2026,18.942128915401081,26.12623634802193,1,1]
["Zaragocilla 66",2026,27.233731276644701,5.9938846698771124,1,1]
["Argos 110",2027,33.445527798814382,7.1057377554210817,1,1]
["Bayunca 13.8",2027,27.2265625,0.125,1,1]
["Bayunca 34.5",2027,26.841970543798261,14.2800449753633,1,1]
["Bayunca 66",2027,26.35195722786494,15.942434631293359,1,1]
["Bgrande 66",2027,23.236692361496839,0.82470172280476106,1,1]
["Bolivar 13.8",2027,24.05840557969217,0.57379878787893901,1,1]
["Bolivar 220",2027,24.394158995400129,0.2,1,1]
["Bolivar 34.5",2027,69.794921875,0.125,1,1]
["Bolivar 500",2027,156.18884541227371,20.010303969766039,1,1]
["Bolivar 66",2027,27.399746088778439,18.363855364550808,1,1]
["Bosque 220",2027,25.561162344874461,12.919421899368359,1,1]
["Bosque 3 13.8",2027,0,0.125,1,1,"No se calcula la capacidad de barra para este nodo"]
["Bosque 5 13.8",2027,0,0.125,1,1,"No se calcula la capacidad de barra para este nodo"]
["Bosque 66",2027,25.493637795896721,0.2,1,1]
["Calamar 13.8",2027,9.4472139449897004,3.6349871039390642,1,1]
["Calamar 34.5",2027,19.31123317472159,5.8794769689413631,1,1]
["Calamar 66",2027,51.074797221453082,4.3504099939975287,1,1]
["Campestre 66",2027,22.65625,4.3698905755657478,1,1]
["Candelaria 110",2027,33.899214203786087,15.80463632715287,1,1]
["Candelaria 13.8",2027,25,0.125,1,1]
["Candelaria 220",2027,31.613267736915841,0.92253688055433258,1,1]
["Carreto 500",2027,300,23.379826637363461,1,1]
["Carreto 66",2027,59.100151062011719,20.75263088974063,1,1]
["Cartagena 220",2027,29.56424241677794,0.1575,1,1]
["Cartagena 66",2027,28.170286019397999,0.1575,1,1]
["Chambacu 66",2027,24.315293505787849,2.8299174742938291,1,1]
["Cospique 66",2027,25.554477913075608,0.09,1,1]
["Coveñas 110",2027,0,20.892610971406199,1,1,"No se calcula la capacidad de barra para este nodo"]
["El Carmen 110",2027,14.673434862932959,19.779505748927921,1,1]
["El Carmen 13.8",2027,0,6.2199164442559187,1,1]
["El Carmen 66",2027,0,15.39155908956611,1,1]
["Gambote 66",2027,26.24728180410175,3.6443680158049849,1,1]
["La Marina 66",2027,25.48828125,9.8469958450227004,1,1]
["Mamonal 13.8",2027,0,2.656082921757879,1,1]
["Mamonal 66",2027,0,16.001422027138499,1,1]
["Manzanillo 13.8",2027,24.87086323634119,0.125,1,1]
["Manzanillo 66",2027,29.025593000909581,31.603872308623441,1,1]
["Membrillal 13.8",2027,23.799327698420441,0.125,1,1]
["Membrillal 66",2027,0,1.10669249029494,1,1]
["Nv Cospique 110",2027,33.744527129922403,20.67607470189153,1,1]
["Nv Cospique 13.8",2027,0,0.2,1,1]
["Nva Toluviejo 110",2027,9.375,14.86405037721426,1,1]
["Pasacaballos 1 13.8",2027,0,0.125,1,1,"No se calcula la capacidad de barra para este nodo"]
["Pasacaballos 110",2027,24.4140625,14.696402450510019,1,1]
["Pasacaballos 13.8",2027,34.6875,9.53889936203805,1,1]
["Pasacaballos 2 13.8",2027,0,0.125,1,1,"No se calcula la capacidad de barra para este nodo"]
["Pasacaballos 220",2027,25,22.7213191460682,1,1]
["Proelectrica 66",2027,22.898023723359021,0.125,1,1]
["Sabanalarga 220",2027,0,0.2,1,1,"No se calcula la capacidad de barra para este nodo"]
["Sabanalarga 500",2027,0,13.949474640244709,1,1,"No se calcula la capacidad de barra para este nodo"]
["San Estanisiao 13.8",2027,12.12766353324314,19.63491750298634,1,1]
["San Estanislao 34.5",2027,12.516973029417681,22.4518271877389,1,1]
["San Jacinto 13.8",2027,8.3227652892029802,3.7320459924753191,1,1]
["San Jacinto 34.5",2027,9.2502966270774891,22.022516011782152,1,1]
["San Jacinto 66",2027,19.765001766032739,2.647037448312807,1,1]
["San Juan Nepomuceno 13.8",2027,8.9461997321772913,13.12572262063958,1,1]
["San Juan Nepomuceno 34.5",2027,6.7999028535779633,23.398669739918411,1,1]
["Sierra Flor 110",2027,0,15.575870825175301,1,1,"No se calcula la capacidad de barra para este nodo"]
["Ternera  13.8",2027,14.78312659185489,0.1575,1,1]
["Ternera 110",2027,31.30361928367072,16.147465115881982,1,1]
["Ternera 13.8",2027,25,0.1575,1,1]
["Ternera 2 13.8",2027,25,0.1575,1,1]
["Ternera 220",2027,0,0.1575,1,1]
["Ternera 66",2027,0,0.151,1,1]
["Toluviejo 1 13.8",2027,0,0.125,1,1,"No se calcula la capacidad de barra para este nodo"]
["Toluviejo 110",2027,0,11.944271304017059,1,1,"No se calcula la capacidad de barra para este nodo"]
["Toluviejo 2 13.8",2027,0,0.125,1,1,"No se calcula la capacidad de barra para este nodo"]
["Toluviejo 220",2027,15.58187809145986,25.186474564953379,1,1]
["Turbaco 110",2027,26.3671875,27.985342174070741,1,1]
["Turbaco 13.8",2027,25,0.125,1,1]
["Villa Estrella 13.8",2027,0,0.125,1,1]
["Villa Estrella 66",2027,27.158820852598861,24.07618256540751,1,1]
["Zambrano 13.8",2027,12.778590648758369,10.679543362833151,1,1]
["Zambrano 34.5",2027,19.42396176874572,3.2598891848580669,1,1]
["Zambrano 66",2027,18.942128915401081,26.137612292233982,1,1]
["Zaragocilla 66",2027,27.233731276644701,6.01215224622484,1,1]
["Argos 110",2028,33.445527798814382,7.1388951657312489,1,1]
["Bayunca 13.8",2028,27.2265625,0.125,1,1]
["Bayunca 34.5",2028,26.841970543798261,14.30560932500841,1,1]
["Bayunca 66",2028,26.35195722786494,15.963091316493051,1,1]
["Bgrande 66",2028,23.236692361496839,0.86814508960971892,1,1]
["Bolivar 13.8",2028,24.05840557969217,0.63221517390919857,1,1]
["Bolivar 220",2028,24.394158995400129,0.2,1,1]
["Bolivar 34.5",2028,69.794921875,0.125,1,1]
["Bolivar 500",2028,156.18884541227371,19.997010324688581,1,1]
["Bolivar 66",2028,27.399746088778439,18.405279700813971,1,1]
["Bosque 220",2028,25.561162344874461,12.944055656121231,1,1]
["Bosque 3 13.8",2028,0,0.125,1,1,"No se calcula la capacidad de barra para este nodo"]
["Bosque 5 13.8",2028,0,0.125,1,1,"No se calcula la capacidad de barra para este nodo"]
["Bosque 66",2028,25.493637795896721,0.2,1,1]
["Calamar 13.8",2028,9.7597139449897004,3.6542050931182541,1,1]
["Calamar 34.5",2028,20.235867833494659,5.8937702477431149,1,1]
["Calamar 66",2028,51.465422221453082,4.3621656573894718,1,1]
["Campestre 66",2028,22.65625,4.4232395755238727,1,1]
["Candelaria 110",2028,25.424410652839569,15.84609648885594,1,1]
["Candelaria 13.8",2028,25,0.125,1,1]
["Candelaria 220",2028,31.613267736915841,0.93600990528504013,1,1]
["Carreto 500",2028,300,23.357877156936858,1,1]
["Carreto 66",2028,59.100151062011719,20.790437198863891,1,1]
["Cartagena 220",2028,29.56424241677794,0.1575,1,1]
["Cartagena 66",2028,28.170286019397999,0.1575,1,1]
["Chambacu 66",2028,24.315293505787849,2.8780667919594509,1,1]
["Cospique 66",2028,25.554477913075608,0.09,1,1]
["Coveñas 110",2028,0,20.906845740398659,1,1,"No se calcula la capacidad de barra para este nodo"]
["El Carmen 110",2028,14.673434862932959,19.788240479065131,1,1]
["El Carmen 13.8",2028,0,6.2643638114833102,1,1]
["El Carmen 66",2028,0,15.40837993244187,1,1]
["Gambote 66",2028,26.247281804101739,3.6574983223743089,1,1]
["La Marina 66",2028,25.48828125,9.8963246477301183,1,1]
["Mamonal 13.8",2028,0,2.70304422319639,1,1]
["Mamonal 66",2028,0,16.030871572126909,1,1]
["Manzanillo 13.8",2028,24.87086323634119,0.125,1,1]
["Manzanillo 66",2028,29.025593000909581,31.623241082286938,1,1]
["Membrillal 13.8",2028,23.799327698420441,0.125,1,1]
["Membrillal 66",2028,0,1.1474663766479909,1,1]
["Nv Cospique 110",2028,33.744527129922403,20.711220478348888,1,1]
["Nv Cospique 13.8",2028,0,0.2,1,1]
["Nva Toluviejo 110",2028,9.375,14.895692984022521,1,1]
["Pasacaballos 1 13.8",2028,0,0.125,1,1,"No se calcula la capacidad de barra para este nodo"]
["Pasacaballos 110",2028,24.4140625,14.738590490378,1,1]
["Pasacaballos 13.8",2028,34.6875,9.5736664075844295,1,1]
["Pasacaballos 2 13.8",2028,0,0.125,1,1,"No se calcula la capacidad de barra para este nodo"]
["Pasacaballos 220",2028,25,22.746096271231849,1,1]
["Proelectrica 66",2028,22.898023723359021,0.125,1,1]
["Sabanalarga 220",2028,0,0.2,1,1,"No se calcula la capacidad de barra para este nodo"]
["Sabanalarga 500",2028,0,13.84400057948061,1,1,"No se calcula la capacidad de barra para este nodo"]
["San Estanisiao 13.8",2028,12.44016353324314,19.646510987733279,1,1]
["San Estanislao 34.5",2028,12.67889418823923,22.457343957787071,1,1]
["San Jacinto 13.8",2028,8.6352652892029802,3.7443778255529421,1,1]
["San Jacinto 34.5",2028,9.5627966270774891,22.0283895862914,1,1]
["San Jacinto 66",2028,19.14734546084421,2.660587334917309,1,1]
["San Juan Nepomuceno 13.8",2028,9.2586997321772913,13.13142781245096,1,1]
["San Juan Nepomuceno 34.5",2028,7.1415444462548372,23.401835917250938,1,1]
["Sierra Flor 110",2028,0,15.59551537416572,1,1,"No se calcula la capacidad de barra para este nodo"]
["Ternera  13.8",2028,15.09562659185489,0.1575,1,1]
["Ternera 110",2028,31.30361928367072,16.175456114800902,1,1]
["Ternera 13.8",2028,25,0.1575,1,1]
["Ternera 2 13.8",2028,25,0.1575,1,1]
["Ternera 220",2028,0,0.1575,1,1]
["Ternera 66",2028,0,0.151,1,1]
["Toluviejo 1 13.8",2028,0,0.125,1,1,"No se calcula la capacidad de barra para este nodo"]
["Toluviejo 110",2028,0,11.970195781080839,1,1,"No se calcula la capacidad de barra para este nodo"]
["Toluviejo 2 13.8",2028,0,0.125,1,1,"No se calcula la capacidad de barra para este nodo"]
["Toluviejo 220",2028,15.58187809145986,25.204466602156842,1,1]
["Turbaco 110",2028,26.3671875,28.007419050669618,1,1]
["Turbaco 13.8",2028,25,0.125,1,1]
["Villa Estrella 13.8",2028,0,0.125,1,1]
["Villa Estrella 66",2028,27.158820852598861,24.09363759138974,1,1]
["Zambrano 13.8",2028,13.091090648758369,10.70576585783777,1,1]
["Zambrano 34.5",2028,19.42396176874572,3.272313688316749,1,1]
["Zambrano 66",2028,18.942128915401081,26.14747667678083,1,1]
["Zaragocilla 66",2028,27.233731276644701,6.0475962914753012,1,1]
["Argos 110",2029,33.445527798814382,7.1057377554210817,1,1]
["Bayunca 13.8",2029,27.2265625,0.125,1,1]
["Bayunca 34.5",2029,26.841970543798261,14.2800449753633,1,1]
["Bayunca 66",2029,26.35195722786494,15.942434631293359,1,1]
["Bgrande 66",2029,23.236692361496839,0.82470172280476106,1,1]
["Bolivar 13.8",2029,24.05840557969217,0.57379878787893901,1,1]
["Bolivar 220",2029,24.394158995400129,0.2,1,1]
["Bolivar 34.5",2029,69.794921875,0.125,1,1]
["Bolivar 500",2029,156.18884541227371,20.010303969766039,1,1]
["Bolivar 66",2029,27.399746088778439,18.363855364550808,1,1]
["Bosque 220",2029,25.561162344874461,12.919421899368359,1,1]
["Bosque 3 13.8",2029,0,0.125,1,1,"No se calcula la capacidad de barra para este nodo"]
["Bosque 5 13.8",2029,0,0.125,1,1,"No se calcula la capacidad de barra para este nodo"]
["Bosque 66",2029,25.493637795896721,0.2,1,1]
["Calamar 13.8",2029,10.0722139449897,3.6349871039390642,1,1]
["Calamar 34.5",2029,20.56123317472159,5.8794769689413631,1,1]
["Calamar 66",2029,51.465422221453082,4.3504099939975287,1,1]
["Campestre 66",2029,22.65625,4.3698905755657478,1,1]
["Candelaria 110",2029,25.424410652839569,15.80463632715287,1,1]
["Candelaria 13.8",2029,25,0.125,1,1]
["Candelaria 220",2029,31.613267736915841,0.92253688055433258,1,1]
["Carreto 500",2029,300,23.379826637363461,1,1]
["Carreto 66",2029,59.100151062011719,20.75263088974063,1,1]
["Cartagena 220",2029,29.56424241677794,0.1575,1,1]
["Cartagena 66",2029,28.170286019397999,0.1575,1,1]
["Chambacu 66",2029,24.315293505787849,2.8299174742938291,1,1]
["Cospique 66",2029,25.554477913075608,0.09,1,1]
["Coveñas 110",2029,0,20.892610971406199,1,1,"No se calcula la capacidad de barra para este nodo"]
["El Carmen 110",2029,14.673434862932959,19.779505748927921,1,1]
["El Carmen 13.8",2029,0,6.2199164442559187,1,1]
["El Carmen 66",2029,0,15.39155908956611,1,1]
["Gambote 66",2029,28.59103180410175,3.6443680158049849,1,1]
["La Marina 66",2029,25.48828125,9.8469958450227004,1,1]
["Mamonal 13.8",2029,0,2.656082921757879,1,1]
["Mamonal 66",2029,0,16.001422027138499,1,1]
["Manzanillo 13.8",2029,24.87086323634119,0.125,1,1]
["Manzanillo 66",2029,29.025593000909581,31.603872308623441,1,1]
["Membrillal 13.8",2029,23.799327698420441,0.125,1,1]
["Membrillal 66",2029,0,1.10669249029494,1,1]
["Nv Cospique 110",2029,33.744527129922403,20.67607470189153,1,1]
["Nv Cospique 13.8",2029,0,0.2,1,1]
["Nva Toluviejo 110",2029,9.375,14.86405037721426,1,1]
["Pasacaballos 1 13.8",2029,0,0.125,1,1,"No se calcula la capacidad de barra para este nodo"]
["Pasacaballos 110",2029,24.4140625,14.696402450510019,1,1]
["Pasacaballos 13.8",2029,22.34375,9.53889936203805,1,1]
["Pasacaballos 2 13.8",2029,0,0.125,1,1,"No se calcula la capacidad de barra para este nodo"]
["Pasacaballos 220",2029,25,22.7213191460682,1,1]
["Proelectrica 66",2029,22.898023723359021,0.125,1,1]
["Sabanalarga 220",2029,0,0.2,1,1,"No se calcula la capacidad de barra para este nodo"]
["Sabanalarga 500",2029,0,13.949474640244709,1,1,"No se calcula la capacidad de barra para este nodo"]
["San Estanisiao 13.8",2029,12.75266353324314,19.63491750298634,1,1]
["San Estanislao 34.5",2029,12.829473029417681,22.4518271877389,1,1]
["San Jacinto 13.8",2029,8.9477652892029802,3.7320459924753191,1,1]
["San Jacinto 34.5",2029,9.8752966270774891,22.022516011782152,1,1]
["San Jacinto 66",2029,19.14734546084421,2.647037448312807,1,1]
["San Juan Nepomuceno 13.8",2029,9.8155835288866875,13.12572262063958,1,1]
["San Juan Nepomuceno 34.5",2029,6.837325716218988,23.398669739918411,1,1]
["Sierra Flor 110",2029,0,15.575870825175301,1,1,"No se calcula la capacidad de barra para este nodo"]
["Ternera  13.8",2029,14.77714992986396,0.1575,1,1]
["Ternera 110",2029,31.30361928367072,16.147465115881982,1,1]
["Ternera 13.8",2029,25,0.1575,1,1]
["Ternera 2 13.8",2029,25,0.1575,1,1]
["Ternera 220",2029,0,0.1575,1,1]
["Ternera 66",2029,0,0.151,1,1]
["Toluviejo 1 13.8",2029,0,0.125,1,1,"No se calcula la capacidad de barra para este nodo"]
["Toluviejo 110",2029,0,11.944271304017059,1,1,"No se calcula la capacidad de barra para este nodo"]
["Toluviejo 2 13.8",2029,0,0.125,1,1,"No se calcula la capacidad de barra para este nodo"]
["Toluviejo 220",2029,15.58187809145986,25.186474564953379,1,1]
["Turbaco 110",2029,26.3671875,27.985342174070741,1,1]
["Turbaco 13.8",2029,25,0.125,1,1]
["Villa Estrella 13.8",2029,0,0.125,1,1]
["Villa Estrella 66",2029,27.158820852598861,24.07618256540751,1,1]
["Zambrano 13.8",2029,13.091090648758369,10.679543362833151,1,1]
["Zambrano 34.5",2029,19.42396176874572,3.2598891848580669,1,1]
["Zambrano 66",2029,18.942128915401081,26.137612292233982,1,1]
["Zaragocilla 66",2029,27.233731276644701,6.01215224622484,1,1]
["Argos 110",2030,33.445527798814382,7.1057377554210817,1,1]
["Bayunca 13.8",2030,27.2265625,0.125,1,1]
["Bayunca 34.5",2030,26.841970543798261,14.2800449753633,1,1]
["Bayunca 66",2030,26.35195722786494,15.942434631293359,1,1]
["Bgrande 66",2030,23.236692361496839,0.82470172280476106,1,1]
["Bolivar 13.8",2030,24.05840557969217,0.57379878787893901,1,1]
["Bolivar 220",2030,24.394158995400129,0.2,1,1]
["Bolivar 34.5",2030,69.794921875,0.125,1,1]
["Bolivar 500",2030,156.18884541227371,20.010303969766039,1,1]
["Bolivar 66",2030,27.399746088778439,18.363855364550808,1,1]
["Bosque 220",2030,25.561162344874461,12.919421899368359,1,1]
["Bosque 3 13.8",2030,0,0.125,1,1,"No se calcula la capacidad de barra para este nodo"]
["Bosque 5 13.8",2030,0,0.125,1,1,"No se calcula la capacidad de barra para este nodo"]
["Bosque 66",2030,25.493637795896721,0.2,1,1]
["Calamar 13.8",2030,10.555901743123711,3.6349871039390642,1,1]
["Calamar 34.5",2030,21.49873317472159,5.8794769689413631,1,1]
["Calamar 66",2030,51.856047221453082,4.3504099939975287,1,1]
["Campestre 66",2030,35.15625,4.3698905755657478,1,1]
["Candelaria 110",2030,25.424410652839569,15.80463632715287,1,1]
["Candelaria 13.8",2030,25,0.125,1,1]
["Candelaria 220",2030,31.613267736915841,0.92253688055433258,1,1]
["Carreto 500",2030,300,23.379826637363461,1,1]
["Carreto 66",2030,57.253271341323853,20.75263088974063,1,1]
["Cartagena 220",2030,29.56424241677794,0.1575,1,1]
["Cartagena 66",2030,28.170286019397999,0.1575,1,1]
["Chambacu 66",2030,24.315293505787849,2.8299174742938291,1,1]
["Cospique 66",2030,25.554477913075608,0.09,1,1]
["Coveñas 110",2030,0,20.892610971406199,1,1,"No se calcula la capacidad de barra para este nodo"]
["El Carmen 110",2030,14.673434862932959,19.779505748927921,1,1]
["El Carmen 13.8",2030,0,6.2199164442559187,1,1]
["El Carmen 66",2030,0,15.39155908956611,1,1]
["Gambote 66",2030,29.76290680410175,3.6443680158049849,1,1]
["La Marina 66",2030,25.48828125,9.8469958450227004,1,1]
["Mamonal 13.8",2030,0,2.656082921757879,1,1]
["Mamonal 66",2030,0,16.001422027138499,1,1]
["Manzanillo 13.8",2030,24.87086323634119,0.125,1,1]
["Manzanillo 66",2030,29.025593000909581,31.603872308623441,1,1]
["Membrillal 13.8",2030,23.799327698420441,0.125,1,1]
["Membrillal 66",2030,0,1.10669249029494,1,1]
["Nv Cospique 110",2030,33.744527129922403,20.67607470189153,1,1]
["Nv Cospique 13.8",2030,0,0.2,1,1]
["Nva Toluviejo 110",2030,9.375,14.86405037721426,1,1]
["Pasacaballos 1 13.8",2030,0,0.125,1,1,"No se calcula la capacidad de barra para este nodo"]
["Pasacaballos 110",2030,36.9140625,14.696402450510019,1,1]
["Pasacaballos 13.8",2030,27.34375,9.53889936203805,1,1]
["Pasacaballos 2 13.8",2030,0,0.125,1,1,"No se calcula la capacidad de barra para este nodo"]
["Pasacaballos 220",2030,25,22.7213191460682,1,1]
["Proelectrica 66",2030,35.398023723359017,0.125,1,1]
["Sabanalarga 220",2030,0,0.2,1,1,"No se calcula la capacidad de barra para este nodo"]
["Sabanalarga 500",2030,0,13.949474640244709,1,1,"No se calcula la capacidad de barra para este nodo"]
["San Estanisiao 13.8",2030,12.87491821511466,19.63491750298634,1,1]
["San Estanislao 34.5",2030,12.99139418823923,22.4518271877389,1,1]
["San Jacinto 13.8",2030,9.2602652892029802,3.7320459924753191,1,1]
["San Jacinto 34.5",2030,10.187796627077489,22.022516011782152,1,1]
["San Jacinto 66",2030,19.14734546084421,2.647037448312807,1,1]
["San Juan Nepomuceno 13.8",2030,10.128083528886689,13.12572262063958,1,1]
["San Juan Nepomuceno 34.5",2030,7.1415444462548372,23.398669739918411,1,1]
["Sierra Flor 110",2030,0,15.575870825175301,1,1,"No se calcula la capacidad de barra para este nodo"]
["Ternera  13.8",2030,14.9559956043447,0.1575,1,1]
["Ternera 110",2030,31.30361928367072,16.147465115881982,1,1]
["Ternera 13.8",2030,25,0.1575,1,1]
["Ternera 2 13.8",2030,25,0.1575,1,1]
["Ternera 220",2030,0,0.1575,1,1]
["Ternera 66",2030,0,0.151,1,1]
["Toluviejo 1 13.8",2030,0,0.125,1,1,"No se calcula la capacidad de barra para este nodo"]
["Toluviejo 110",2030,0,11.944271304017059,1,1,"No se calcula la capacidad de barra para este nodo"]
["Toluviejo 2 13.8",2030,0,0.125,1,1,"No se calcula la capacidad de barra para este nodo"]
["Toluviejo 220",2030,15.58187809145986,25.186474564953379,1,1]
["Turbaco 110",2030,26.3671875,27.985342174070741,1,1]
["Turbaco 13.8",2030,25,0.125,1,1]
["Villa Estrella 13.8",2030,0,0.125,1,1]
["Villa Estrella 66",2030,27.158820852598861,24.07618256540751,1,1]
["Zambrano 13.8",2030,13.091090648758369,10.679543362833151,1,1]
["Zambrano 34.5",2030,19.42396176874572,3.2598891848580669,1,1]
["Zambrano 66",2030,18.942128915401081,26.137612292233982,1,1]
["Zaragocilla 66",2030,27.233731276644701,6.01215224622484,1,1]
["Argos 110",2031,45.945527798814382,7.1057370416973384,1,1]
["Bayunca 13.8",2031,30.64453125,0.125,1,1]
["Bayunca 34.5",2031,33.70493008773056,14.2800449753633,1,1]
["Bayunca 66",2031,51.351957227864943,15.942434631293359,1,1]
["Bgrande 66",2031,48.236692361496843,0.82470172280476106,1,1]
["Bolivar 13.8",2031,27.285001750113238,0.57379878787893901,1,1]
["Bolivar 220",2031,49.394158995400133,0.2,1,1]
["Bolivar 34.5",2031,69.794921875,0.125,1,1]
["Bolivar 500",2031,156.18884541227371,20.006880233177771,1,1]
["Bolivar 66",2031,52.399746088778443,18.363855364550808,1,1]
["Bosque 220",2031,50.561162344874447,12.91936195324768,1,1]
["Bosque 3 13.8",2031,0,0.125,1,1,"No se calcula la capacidad de barra para este nodo"]
["Bosque 5 13.8",2031,0,0.125,1,1,"No se calcula la capacidad de barra para este nodo"]
["Bosque 66",2031,50.493637795896717,0.2,1,1]
["Calamar 13.8",2031,10.868401743123711,3.6349871039390642,1,1]
["Calamar 34.5",2031,22.42336783349467,5.8794765890905794,1,1]
["Calamar 66",2031,51.856047221453082,4.3504099939975287,1,1]
["Campestre 66",2031,60.15625,4.3698905755657478,1,1]
["Candelaria 110",2031,50.424410652839569,15.804633330931241,1,1]
["Candelaria 13.8",2031,50,0.125,1,1]
["Candelaria 220",2031,47.591932224720232,0.92242822413368231,1,1]
["Carreto 500",2031,300,23.379826637363461,1,1]
["Carreto 66",2031,57.253271341323853,20.752431245019189,1,1]
["Cartagena 220",2031,54.564242416777937,0.1575,1,1]
["Cartagena 66",2031,53.170286019397992,0.1575,1,1]
["Chambacu 66",2031,49.315293505787849,2.8299174742938291,1,1]
["Cospique 66",2031,50.554477913075601,0.09,1,1]
["Coveñas 110",2031,0,20.892610971406199,1,1,"No se calcula la capacidad de barra para este nodo"]
["El Carmen 110",2031,14.673434862932959,19.779505734378169,1,1]
["El Carmen 13.8",2031,0,6.2199164442559187,1,1]
["El Carmen 66",2031,0,15.3915590663491,1,1]
["Gambote 66",2031,31.32540680410175,3.6443680158049849,1,1]
["La Marina 66",2031,50.48828125,9.8469958450227004,1,1]
["Mamonal 13.8",2031,0,2.656082921757879,1,1]
["Mamonal 66",2031,0,16.001422027138499,1,1]
["Manzanillo 13.8",2031,44.870863236341187,0.125,1,1]
["Manzanillo 66",2031,54.025593000909581,31.603872308623441,1,1]
["Membrillal 13.8",2031,41.441640725670197,0.125,1,1]
["Membrillal 66",2031,0,1.10669249029494,1,1]
["Nv Cospique 110",2031,46.244527129922403,20.676073994252501,1,1]
["Nv Cospique 13.8",2031,0,0.2,1,1]
["Nva Toluviejo 110",2031,9.375,14.86405034826584,1,1]
["Pasacaballos 1 13.8",2031,0,0.125,1,1,"No se calcula la capacidad de barra para este nodo"]
["Pasacaballos 110",2031,36.9140625,14.69640245144174,1,1]
["Pasacaballos 13.8",2031,36.40625,9.5388993620376095,1,1]
["Pasacaballos 2 13.8",2031,0,0.125,1,1,"No se calcula la capacidad de barra para este nodo"]
["Pasacaballos 220",2031,50,22.721305260194729,1,1]
["Proelectrica 66",2031,54.148023723359017,0.125,1,1]
["Sabanalarga 220",2031,0,0.2,1,1,"No se calcula la capacidad de barra para este nodo"]
["Sabanalarga 500",2031,0,13.89365353127403,1,1,"No se calcula la capacidad de barra para este nodo"]
["San Estanisiao 13.8",2031,12.68201809158775,19.634917502986049,1,1]
["San Estanislao 34.5",2031,13.141973029417681,22.4518271877389,1,1]
["San Jacinto 13.8",2031,9.5727652892029802,3.7320459924753191,1,1]
["San Jacinto 34.5",2031,10.500296627077489,22.022516010108941,1,1]
["San Jacinto 66",2031,18.548990915192832,2.647037448312807,1,1]
["San Juan Nepomuceno 13.8",2031,10.440583528886689,13.12572262063947,1,1]
["San Juan Nepomuceno 34.5",2031,7.4540444462548372,23.398669739918411,1,1]
["Sierra Flor 110",2031,0,15.575870825175301,1,1,"No se calcula la capacidad de barra para este nodo"]
["Ternera  13.8",2031,14.771546809247461,0.1575,1,1]
["Ternera 110",2031,56.303619283670713,16.147463397513661,1,1]
["Ternera 13.8",2031,50,0.1575,1,1]
["Ternera 2 13.8",2031,50,0.1575,1,1]
["Ternera 220",2031,0,0.1575,1,1]
["Ternera 66",2031,0,0.151,1,1]
["Toluviejo 1 13.8",2031,0,0.125,1,1,"No se calcula la capacidad de barra para este nodo"]
["Toluviejo 110",2031,0,11.94427129331241,1,1,"No se calcula la capacidad de barra para este nodo"]
["Toluviejo 2 13.8",2031,0,0.125,1,1,"No se calcula la capacidad de barra para este nodo"]
["Toluviejo 220",2031,15.58187809145986,25.186474320594812,1,1]
["Turbaco 110",2031,51.3671875,27.985342174070741,1,1]
["Turbaco 13.8",2031,40,0.125,1,1]
["Villa Estrella 13.8",2031,0,0.125,1,1]
["Villa Estrella 66",2031,52.158820852598858,24.07618256540751,1,1]
["Zambrano 13.8",2031,13.132765134443421,10.679543362833151,1,1]
["Zambrano 34.5",2031,19.42396176874572,3.2598891848255889,1,1]
["Zambrano 66",2031,18.942128915401081,26.137612285829661,1,1]
["Zaragocilla 66",2031,52.233731276644697,6.01215224622484,1,1]
["Argos 110",2032,45.945527798814382,7.1057377554210817,1,1]
["Bayunca 13.8",2032,30.95703125,0.125,1,1]
["Bayunca 34.5",2032,33.716970543798261,14.2800449753633,1,1]
["Bayunca 66",2032,76.351957227864943,15.942434631293359,1,1]
["Bgrande 66",2032,73.236692361496836,0.82470172280476106,1,1]
["Bolivar 13.8",2032,27.027411480961408,0.57379878787893901,1,1]
["Bolivar 220",2032,74.394158995400119,0.2,1,1]
["Bolivar 34.5",2032,69.794921875,0.125,1,1]
["Bolivar 500",2032,156.18884541227371,20.010303969766039,1,1]
["Bolivar 66",2032,77.399746088778443,18.363855364550808,1,1]
["Bosque 220",2032,75.561162344874447,12.919421899368359,1,1]
["Bosque 3 13.8",2032,0,0.125,1,1,"No se calcula la capacidad de barra para este nodo"]
["Bosque 5 13.8",2032,0,0.125,1,1,"No se calcula la capacidad de barra para este nodo"]
["Bosque 66",2032,75.493637795896717,0.2,1,1]
["Calamar 13.8",2032,11.6347139449897,3.6349871039390642,1,1]
["Calamar 34.5",2032,23.36086783349467,5.8794769689413631,1,1]
["Calamar 66",2032,52.637297221453082,4.3504099939975287,1,1]
["Campestre 66",2032,72.65625,4.3698905755657478,1,1]
["Candelaria 110",2032,50.424410652839569,15.80463632715287,1,1]
["Candelaria 13.8",2032,50,0.125,1,1]
["Candelaria 220",2032,47.591932224720232,0.92253688055433258,1,1]
["Carreto 500",2032,300,23.379826637363461,1,1]
["Carreto 66",2032,55.464106611907482,20.75263088974063,1,1]
["Cartagena 220",2032,55.93299207715058,0.1575,1,1]
["Cartagena 66",2032,65.670286019397992,0.1575,1,1]
["Chambacu 66",2032,74.315293505787849,2.8299174742938291,1,1]
["Cospique 66",2032,61.932101648065839,0.09,1,1]
["Coveñas 110",2032,0,20.892610971406199,1,1,"No se calcula la capacidad de barra para este nodo"]
["El Carmen 110",2032,11.00507614719972,19.779505748927921,1,1]
["El Carmen 13.8",2032,0,6.2199164442559187,1,1]
["El Carmen 66",2032,0,15.39155908956611,1,1]
["Gambote 66",2032,32.106656804101753,3.6443680158049849,1,1]
["La Marina 66",2032,75.48828125,9.8469958450227004,1,1]
["Mamonal 13.8",2032,0,2.656082921757879,1,1]
["Mamonal 66",2032,0,16.001422027138499,1,1]
["Manzanillo 13.8",2032,49.519328868677462,0.125,1,1]
["Manzanillo 66",2032,66.525593000909581,31.603872308623441,1,1]
["Membrillal 13.8",2032,42.066640725670197,0.125,1,1]
["Membrillal 66",2032,0,1.10669249029494,1,1]
["Nv Cospique 110",2032,46.244527129922403,20.67607470189153,1,1]
["Nv Cospique 13.8",2032,0,0.2,1,1]
["Nva Toluviejo 110",2032,9.375,14.86405037721426,1,1]
["Pasacaballos 1 13.8",2032,0,0.125,1,1,"No se calcula la capacidad de barra para este nodo"]
["Pasacaballos 110",2032,36.9140625,14.696402450510019,1,1]
["Pasacaballos 13.8",2032,36.40625,9.53889936203805,1,1]
["Pasacaballos 2 13.8",2032,0,0.125,1,1,"No se calcula la capacidad de barra para este nodo"]
["Pasacaballos 220",2032,50,22.7213191460682,1,1]
["Proelectrica 66",2032,60.963902849395531,0.125,1,1]
["Sabanalarga 220",2032,0,0.2,1,1,"No se calcula la capacidad de barra para este nodo"]
["Sabanalarga 500",2032,0,13.949474640244709,1,1,"No se calcula la capacidad de barra para este nodo"]
["San Estanisiao 13.8",2032,12.99451809158775,19.63491750298634,1,1]
["San Estanislao 34.5",2032,13.30389418823923,22.4518271877389,1,1]
["San Jacinto 13.8",2032,9.8852652892029802,3.7320459924753191,1,1]
["San Jacinto 34.5",2032,11.03637316645673,22.022516011782152,1,1]
["San Jacinto 66",2032,17.96933494909306,2.647037448312807,1,1]
["San Juan Nepomuceno 13.8",2032,10.821199732177289,13.12572262063958,1,1]
["San Juan Nepomuceno 34.5",2032,7.7665444462548372,23.398669739918411,1,1]
["Sierra Flor 110",2032,0,15.575870825175301,1,1,"No se calcula la capacidad de barra para este nodo"]
["Ternera  13.8",2032,14.64624587907316,0.1575,1,1]
["Ternera 110",2032,56.303619283670713,16.147465115881982,1,1]
["Ternera 13.8",2032,50,0.1575,1,1]
["Ternera 2 13.8",2032,50,0.1575,1,1]
["Ternera 220",2032,0,0.1575,1,1]
["Ternera 66",2032,0,0.151,1,1]
["Toluviejo 1 13.8",2032,0,0.125,1,1,"No se calcula la capacidad de barra para este nodo"]
["Toluviejo 110",2032,0,11.944271304017059,1,1,"No se calcula la capacidad de barra para este nodo"]
["Toluviejo 2 13.8",2032,0,0.125,1,1,"No se calcula la capacidad de barra para este nodo"]
["Toluviejo 220",2032,15.58187809145986,25.186474564953379,1,1]
["Turbaco 110",2032,51.3671875,27.985342174070741,1,1]
["Turbaco 13.8",2032,40,0.125,1,1]
["Villa Estrella 13.8",2032,0,0.125,1,1]
["Villa Estrella 66",2032,77.158820852598865,24.07618256540751,1,1]
["Zambrano 13.8",2032,12.97814181766357,10.679543362833151,1,1]
["Zambrano 34.5",2032,19.42396176874572,3.2598891848580669,1,1]
["Zambrano 66",2032,18.942128915401081,26.137612292233982,1,1]
["Zaragocilla 66",2032,77.233731276644704,6.01215224622484,1,1]
["Argos 110",2033,45.945527798814382,7.11445677081635,1,1]
["Bayunca 13.8",2033,31.89453125,0.125,1,1]
["Bayunca 34.5",2033,33.579385397488977,14.28991400456488,1,1]
["Bayunca 66",2033,76.351957227864943,15.949820999760281,1,1]
["Bgrande 66",2033,73.236692361496836,0.83078186774131879,1,1]
["Bolivar 13.8",2033,27.122657890731158,0.59658426677832921,1,1]
["Bolivar 220",2033,74.394158995400119,0.2,1,1]
["Bolivar 34.5",2033,69.794921875,0.125,1,1]
["Bolivar 500",2033,156.18884541227371,19.957716313051471,1,1]
["Bolivar 66",2033,77.399746088778443,18.37328603315434,1,1]
["Bosque 220",2033,75.561162344874447,12.903866775830981,1,1]
["Bosque 3 13.8",2033,0,0.125,1,1,"No se calcula la capacidad de barra para este nodo"]
["Bosque 5 13.8",2033,0,0.125,1,1,"No se calcula la capacidad de barra para este nodo"]
["Bosque 66",2033,75.493637795896717,0.2,1,1]
["Calamar 13.8",2033,11.9472139449897,3.6244577809245739,1,1]
["Calamar 34.5",2033,24.29836783349467,5.8715430657861409,1,1]
["Calamar 66",2033,52.637297221453082,4.3431168409255667,1,1]
["Campestre 66",2033,72.65625,4.3659323537061567,1,1]
["Candelaria 110",2033,50.424410652839569,15.812994753758071,1,1]
["Candelaria 13.8",2033,50,0.125,1,1]
["Candelaria 220",2033,50.716932224720239,0.88240074758846987,1,1]
["Carreto 500",2033,300,23.29063516626983,1,1]
["Carreto 66",2033,55.464106611907482,20.723468943706251,1,1]
["Cartagena 220",2033,59.057992077150573,0.1575,1,1]
["Cartagena 66",2033,65.670286019397992,0.1575,1,1]
["Chambacu 66",2033,74.315293505787849,2.8337477985877899,1,1]
["Cospique 66",2033,61.932101648065839,0.09,1,1]
["Coveñas 110",2033,0,20.890168730325168,1,1,"No se calcula la capacidad de barra para este nodo"]
["El Carmen 110",2033,11.00507614719972,19.777479642399381,1,1]
["El Carmen 13.8",2033,0,6.2040680821199601,1,1]
["El Carmen 66",2033,0,15.385570216742771,1,1]
["Gambote 66",2033,31.604990291537661,3.6417369937241908,1,1]
["La Marina 66",2033,75.48828125,9.8495630819606284,1,1]
["Mamonal 13.8",2033,0,2.5763036638040191,1,1]
["Mamonal 66",2033,0,15.99137447986393,1,1]
["Manzanillo 13.8",2033,49.519328868677462,0.125,1,1]
["Manzanillo 66",2033,66.525593000909581,31.610907633324501,1,1]
["Membrillal 13.8",2033,42.861827698420441,0.125,1,1]
["Membrillal 66",2033,0,1.1079576769665,1,1]
["Nv Cospique 110",2033,46.244527129922403,20.684737859430619,1,1]
["Nv Cospique 13.8",2033,0,0.2,1,1]
["Nva Toluviejo 110",2033,9.375,14.85646443469431,1,1]
["Pasacaballos 1 13.8",2033,0,0.125,1,1,"No se calcula la capacidad de barra para este nodo"]
["Pasacaballos 110",2033,36.9140625,14.702617164586441,1,1]
["Pasacaballos 13.8",2033,36.40625,9.5516986365292098,1,1]
["Pasacaballos 2 13.8",2033,0,0.125,1,1,"No se calcula la capacidad de barra para este nodo"]
["Pasacaballos 220",2033,50,22.720592076598749,1,1]
["Proelectrica 66",2033,55.248536957264697,0.125,1,1]
["Sabanalarga 220",2033,0,0.2,1,1,"No se calcula la capacidad de barra para este nodo"]
["Sabanalarga 500",2033,0,13.72746207057034,1,1,"No se calcula la capacidad de barra para este nodo"]
["San Estanisiao 13.8",2033,13.30701809158775,19.628788405225361,1,1]
["San Estanislao 34.5",2033,13.61639418823923,22.4488570642668,1,1]
["San Jacinto 13.8",2033,10.19776528920298,3.727337999674464,1,1]
["San Jacinto 34.5",2033,11.66137316645673,22.020294178444829,1,1]
["San Jacinto 66",2033,17.96933494909306,2.6405953484487479,1,1]
["San Juan Nepomuceno 13.8",2033,11.690583528886689,13.077363367512531,1,1]
["San Juan Nepomuceno 34.5",2033,8.0790444462548372,23.39748264319844,1,1]
["Sierra Flor 110",2033,0,15.57037169886115,1,1,"No se calcula la capacidad de barra para este nodo"]
["Ternera  13.8",2033,14.700854220858041,0.1575,1,1]
["Ternera 110",2033,56.303619283670713,16.15567728256142,1,1]
["Ternera 13.8",2033,50,0.1575,1,1]
["Ternera 2 13.8",2033,50,0.1575,1,1]
["Ternera 220",2033,0,0.1575,1,1]
["Ternera 66",2033,0,0.151,1,1]
["Toluviejo 1 13.8",2033,0,0.125,1,1,"No se calcula la capacidad de barra para este nodo"]
["Toluviejo 110",2033,0,11.93991417200515,1,1,"No se calcula la capacidad de barra para este nodo"]
["Toluviejo 2 13.8",2033,0,0.125,1,1,"No se calcula la capacidad de barra para este nodo"]
["Toluviejo 220",2033,15.58187809145986,25.18226568440673,1,1]
["Turbaco 110",2033,51.3671875,27.990431199567482,1,1]
["Turbaco 13.8",2033,40,0.125,1,1]
["Villa Estrella 13.8",2033,0,0.125,1,1]
["Villa Estrella 66",2033,77.158820852598865,24.082664691802059,1,1]
["Zambrano 13.8",2033,13.29064181766357,10.67008037657304,1,1]
["Zambrano 34.5",2033,19.42396176874572,3.255527208806904,1,1]
["Zambrano 66",2033,18.942128915401081,26.133991653084589,1,1]
["Zaragocilla 66",2033,77.233731276644704,6.016292417391071,1,1]
["Plato 13.8",2023,19.593963623046879,19.11307778452435,1,1]
["Plato 34.5",2023,27.578125,13.697030063094919,1,1]
["Plato 13.8",2024,18.2662034034729,17.72877501858633,1,1]
["Plato 34.5",2024,18.28125,12.53791954854335,1,1]
["Plato 13.8",2025,9.281463623046875,17.41452448774379,1,1]
["Plato 34.5",2025,9.23828125,12.356144932464369,1,1]
["Plato 13.8",2026,19.281463623046879,17.228444847652771,1,1]
["Plato 34.5",2026,19.23828125,12.14885786641306,1,1]
["Plato 13.8",2027,19.281463623046879,17.246015293508609,1,1]
["Plato 34.5",2027,19.23828125,12.15750023251921,1,1]
["Plato 13.8",2028,19.281463623046879,17.26048313692775,1,1]
["Plato 34.5",2028,19.23828125,12.16465265003988,1,1]
["Plato 13.8",2029,19.281463623046879,17.246015293508609,1,1]
["Plato 34.5",2029,19.23828125,12.15750023251921,1,1]
["Plato 13.8",2030,19.281463623046879,17.246015293508609,1,1]
["Plato 34.5",2030,19.23828125,12.15750023251921,1,1]
["Plato 13.8",2031,19.281463623046879,17.246015293508119,1,1]
["Plato 34.5",2031,19.23828125,12.15750023250971,1,1]
["Plato 13.8",2032,19.281463623046879,17.246015293508609,1,1]
["Plato 34.5",2032,19.23828125,12.15750023251921,1,1]
["Plato 13.8",2033,19.281463623046879,17.2411720004492,1,1]
["Plato 34.5",2033,19.23828125,12.155082944682871,1,1]

{"sheet":"criterios","index":2,"n_rows":8,"n_cols":2,"rows_kept":8,"cut":false,"hidden":false,"merged":[]}
["nombre","ponderacion"]
["BT_Confi",1]
["BT_Flex",1]
["EC_RE",1]
["EC_RP",0.5]
["EC_Per",1]
["EC_Mar",1]
["B_Ambiental",0.3]

{"sheet":"obras","index":3,"n_rows":1,"n_cols":13,"rows_kept":1,"cut":false,"hidden":false,"merged":[]}
["nombre","barra","zona","area","capacidadbarra","cortocircuito","capacidadzona","capacidadarea","costo","periodoini","excluyente","dependiente","obligatorio"]

{"sheet":"proyectos","index":4,"n_rows":3,"n_cols":14,"rows_kept":3,"cut":false,"hidden":false,"merged":[]}
["nombre","capacidad","tipo","barra","area","obra","excluyente","fpo","periodoIni","fpomax","fila","obligatorio","activo","ordenLlegada"]
["SC_831_A1",{"$f":"VLOOKUP($A2,'[1]Bolsa 3'!$A:$X,5,FALSE)","v":19.899999999999999},{"$f":"VLOOKUP($A2,'[1]Bolsa 3'!$A:$X,6,FALSE)","v":"Solar FV"},{"$f":"VLOOKUP($A2,'[1]Bolsa 3'!$A:$X,7,FALSE)","v":"Zambrano 66"},{"$f":"VLOOKUP($A2,'[1]Bolsa 3'!$A:$X,13,FALSE)","v":"Bolívar"},null,{"$f":"IF(RIGHT(A2,2)=\"A1\",\"\",IF(COUNTIF('[1]Bolsa 3'!A:A,VLOOKUP($A2,'[1]Bolsa 3'!$A:$X,8,FALSE)&\"_A1\")>0,VLOOKUP($A2,'[1]Bolsa 3'!$A:$X,8,FALSE)&\"_A1\",\"\"))","v":""},{"$f":"VLOOKUP($A2,'[1]Bolsa 3'!$A:$X,9,FALSE)","v":"2023-12-31"},{"$f":"YEAR(H2)","v":2023},{"$f":"H2","v":"2023-12-31"},{"$f":"VLOOKUP($A2,'[1]Bolsa 3'!$A:$X,18,FALSE)","v":2},0,1,{"$f":"VLOOKUP($A2,'[1]Bolsa 3'!$A:$X,23,FALSE)","v":56}]
["SC_831_A2",{"$f":"VLOOKUP($A3,'[1]Bolsa 3'!$A:$X,5,FALSE)","v":19.899999999999999},{"$f":"VLOOKUP($A3,'[1]Bolsa 3'!$A:$X,6,FALSE)","v":"Solar FV"},{"$f":"VLOOKUP($A3,'[1]Bolsa 3'!$A:$X,7,FALSE)","v":"Zambrano 34.5"},{"$f":"VLOOKUP($A3,'[1]Bolsa 3'!$A:$X,13,FALSE)","v":"Bolívar"},null,{"$f":"IF(RIGHT(A3,2)=\"A1\",\"\",IF(COUNTIF('[1]Bolsa 3'!A:A,VLOOKUP($A3,'[1]Bolsa 3'!$A:$X,8,FALSE)&\"_A1\")>0,VLOOKUP($A3,'[1]Bolsa 3'!$A:$X,8,FALSE)&\"_A1\",\"\"))","v":{"$error":"#VALUE!"}},{"$f":"VLOOKUP($A3,'[1]Bolsa 3'!$A:$X,9,FALSE)","v":"2023-12-31"},2023,"2023-12-31",{"$f":"VLOOKUP($A3,'[1]Bolsa 3'!$A:$X,18,FALSE)","v":2},0,1,{"$f":"VLOOKUP($A3,'[1]Bolsa 3'!$A:$X,23,FALSE)","v":57}]

{"sheet":"cortocircuito","index":5,"n_rows":3620,"n_cols":3,"rows_kept":3620,"cut":false,"hidden":false,"merged":[]}
["nombre","barra","aportecortocircuito"]
["SC_1841_A2","Argos 110",0.11]
["SC_1841_A2","Bayunca 66",0.05]
["SC_1841_A2","Bgrande 66",0.49]
["SC_1841_A2","Bolivar 220",0.28000000000000003]
["SC_1841_A2","Bolivar 500",7.0000000000000007E-2]
["SC_1841_A2","Bolivar 66",0.12]
["SC_1841_A2","Bosque 220",0.24]
["SC_1841_A2","Bosque 66",0.64]
["SC_1841_A2","Calamar 66",0.01]
["SC_1841_A2","Campestre 66",0.67]
["SC_1841_A2","Candelaria 110",0.16]
["SC_1841_A2","Candelaria 220",0.32]
["SC_1841_A2","Carreto 500",0.04]
["SC_1841_A2","Carreto 66",0.03]
["SC_1841_A2","Cartagena 220",0.31]
["SC_1841_A2","Cartagena 66",0.6]
["SC_1841_A2","Chambacu 66",0.48]
["SC_1841_A2","Cospique 66",0.53]
["SC_1841_A2","El Carmen 110",0.01]
["SC_1841_A2","El Carmen 66",0.01]
["SC_1841_A2","Gambote 66",0.09]
["SC_1841_A2","La Marina 66",0.54]
["SC_1841_A2","Mamonal 66",0.32]
["SC_1841_A2","Manzanillo 66",0.05]
["SC_1841_A2","Membrillal 66",0.47]
["SC_1841_A2","Nv Cospique 110",0.12]
["SC_1841_A2","Pasacaballos 110",0.14000000000000001]
["SC_1841_A2","Pasacaballos 220",0.09]
["SC_1841_A2","Proelectrica 66",0.56000000000000005]
["SC_1841_A2","Sabanalarga 220",0.15]
["SC_1841_A2","San Jacinto 66",0.01]
["SC_1841_A2","Ternera 110",0.09]
["SC_1841_A2","Ternera 220",0.31]
["SC_1841_A2","Ternera 66",1.05]
["SC_1841_A2","Toluviejo 110",0.05]
["SC_1841_A2","Toluviejo 220",0.03]
["SC_1841_A2","Turbaco 110",7.0000000000000007E-2]
["SC_1841_A2","Villa Estrella 66",0.04]
["SC_1841_A2","Zambrano 66",0.01]
["SC_1841_A2","Zaragocilla 66",0.43]
["SC_1841_A2","Sierra Flor 110",0.03]
["SC_1841_A2","Coveñas 110",0.02]
["SC_1975_A1","Argos 110",0.1]
["SC_1975_A1","Bayunca 66",7.0000000000000007E-2]
["SC_1975_A1","Bgrande 66",0.22]
["SC_1975_A1","Bolivar 220",0.85]
["SC_1975_A1","Bolivar 500",0.14000000000000001]
["SC_1975_A1","Bolivar 66",0.16]
["SC_1975_A1","Bosque 220",0.21]
["SC_1975_A1","Bosque 66",0.3]
["SC_1975_A1","Calamar 66",0.01]
["SC_1975_A1","Campestre 66",0.21]
["SC_1975_A1","Candelaria 110",0.14000000000000001]
["SC_1975_A1","Candelaria 220",0.27]
["SC_1975_A1","Carreto 500",0.05]
["SC_1975_A1","Carreto 66",0.04]
["SC_1975_A1","Cartagena 220",0.3]
["SC_1975_A1","Cartagena 66",0.23]
["SC_1975_A1","Chambacu 66",0.22]
["SC_1975_A1","Cospique 66",0.14000000000000001]
["SC_1975_A1","El Carmen 110",0.01]
["SC_1975_A1","El Carmen 66",0.01]
["SC_1975_A1","Gambote 66",0.02]
["SC_1975_A1","La Marina 66",0.24]
["SC_1975_A1","Mamonal 66",0.09]
["SC_1975_A1","Manzanillo 66",0.06]
["SC_1975_A1","Membrillal 66",0.14000000000000001]
["SC_1975_A1","Nv Cospique 110",0.11]
["SC_1975_A1","Pasacaballos 110",0.14000000000000001]
["SC_1975_A1","Pasacaballos 220",0.11]
["SC_1975_A1","Proelectrica 66",0.2]
["SC_1975_A1","Sabanalarga 220",0.19]
["SC_1975_A1","San Jacinto 66",0.01]
["SC_1975_A1","Ternera 110",0.08]
["SC_1975_A1","Ternera 220",0.24]
["SC_1975_A1","Ternera 66",0.23]
["SC_1975_A1","Toluviejo 110",0.06]
["SC_1975_A1","Toluviejo 220",0.04]
["SC_1975_A1","Turbaco 110",7.0000000000000007E-2]
["SC_1975_A1","Villa Estrella 66",0.06]
["SC_1975_A1","Zambrano 66",0.01]
["SC_1975_A1","Zaragocilla 66",0.11]
["SC_1975_A1","Sierra Flor 110",0.03]
["SC_1975_A1","Coveñas 110",0.03]
["SC_436_A2","Bolivar 220",0.56000000000000005]
["SC_436_A2","Bolivar 500",0.08]
["SC_436_A2","Bosque 220",0.13]
["SC_436_A2","Carreto 500",0.01]
["SC_436_A2","Pasacaballos 110",0.03]
["SC_436_A2","Pasacaballos 220",0.03]
["SC_436_A2","Sabanalarga 220",0.11]
["SC_436_A2","Sabanalarga 500",0.06]
["SC_436_A2","Candelaria 220",0.26]
["SC_436_A2","Cartagena 220",0.28000000000000003]
["SC_436_A2","Ternera 110",0]
["SC_436_A2","Ternera 220",0.22]
["SC_436_A2","Toluviejo 220",0]
["SC_436_A2","Turbaco 110",0.01]
["SC_1801_A1","Bolivar 66",0.12]
["SC_1801_A1","Bayunca 13.8",0.04]
["SC_1801_A1","Bayunca 66",0.08]
["SC_1801_A1","Manzanillo 13.8",0.66]
["SC_1801_A1","Villa Estrella 66",0.01]
["SC_1801_A1","Manzanillo 66",0.13]
["SC_2099_A1","Bolivar 13.8",0.28000000000000003]
["SC_2099_A1","Bosque 3 13.8",7.0000000000000007E-2]
["SC_2099_A1","Bosque 5 13.8",7.0000000000000007E-2]
["SC_2099_A1","Candelaria 13.8",0.2]
["SC_2099_A1","El Carmen 13.8",0.02]
["SC_2099_A1","Pasacaballos 1 13.8",0.26]
["SC_2099_A1","Pasacaballos 2 13.8",0.26]
["SC_2099_A1","Ternera 13.8",0.14000000000000001]
["SC_2099_A1","Villa Estrella 13.8",0.27]
["SC_2099_A1","Bolivar 34.5",0.08]
["SC_2099_A1","Bosque 66",0.1]
["SC_2099_A1","Bayunca 66",0.1]
["SC_2099_A1","Bgrande 66",7.0000000000000007E-2]
["SC_2099_A1","Calamar 66",0.01]
["SC_2099_A1","Campestre 66",0.09]
["SC_2099_A1","Carreto 66",0.02]
["SC_2099_A1","Cartagena 66",0.08]
["SC_2099_A1","Chambacu 66",7.0000000000000007E-2]
["SC_2099_A1","Cospique 66",0.06]
["SC_2099_A1","El Carmen 66",0.01]
["SC_2099_A1","Gambote 66",0.01]
["SC_2099_A1","La Marina 66",0.08]
["SC_2099_A1","Mamonal 66",0.04]
["SC_2099_A1","Membrillal 66",0.05]
["SC_2099_A1","Proelectrica 66",0.08]
["SC_2099_A1","Ternera 66",0.12]
["SC_2099_A1","Bolivar 66",0.27]
["SC_2099_A1","Manzanillo 66",0.09]
["SC_2099_A1","San Jacinto 66",0.01]
["SC_2099_A1","Villa Estrella 66",0.1]
["SC_2099_A1","Zaragocilla 66",0.05]
["SC_2099_A1","Zambrano 66",0.01]
["SC_2099_A1","Argos 110",0.03]
["SC_2099_A1","El Carmen 110",0]
["SC_2099_A1","Nva Toluviejo 110",0.02]
["SC_2099_A1","Nv Cospique 110",0.03]
["SC_2099_A1","Pasacaballos 110",0.05]
["SC_2099_A1","Ternera 110",0.02]
["SC_2099_A1","Turbaco 110",0.02]
["SC_2099_A1","Bosque 220",0.05]
["SC_2099_A1","Candelaria 220",7.0000000000000007E-2]
["SC_2099_A1","Cartagena 220",0.08]
["SC_2099_A1","Ternera 220",0.06]
["SC_2099_A1","Pasacaballos 220",0.04]
["SC_2099_A1","Sabanalarga 220",0.05]
["SC_2099_A1","Bolivar 220",0.1]
["SC_2099_A1","Toluviejo 220",0.01]
["SC_2099_A1","Carreto 500",0.02]
["SC_2099_A1","Bolivar 500",0.03]
["SC_2099_A1","Sierra Flor 110",0.02]
["SC_1896_A2","Argos 110",0.13]
["SC_1896_A2","Bayunca 66",0.05]
["SC_1896_A2","Bgrande 66",0.25]
["SC_1896_A2","Bolivar 220",0.31]
["SC_1896_A2","Bolivar 500",7.0000000000000007E-2]
["SC_1896_A2","Bolivar 66",0.12]
["SC_1896_A2","Bosque 220",0.21]
["SC_1896_A2","Bosque 66",0.35]
["SC_1896_A2","Calamar 66",0.01]
["SC_1896_A2","Campestre 66",0.25]
["SC_1896_A2","Candelaria 110",0.18]
["SC_1896_A2","Candelaria 220",0.73]
["SC_1896_A2","Carreto 500",0.04]
["SC_1896_A2","Carreto 66",0.03]
["SC_1896_A2","Cartagena 220",0.54]
["SC_1896_A2","Cartagena 66",0.28999999999999998]
["SC_1896_A2","Chambacu 66",0.25]
["SC_1896_A2","Cospique 66",0.17]
["SC_1896_A2","El Carmen 110",0.01]
["SC_1896_A2","El Carmen 66",0.01]
["SC_1896_A2","Gambote 66",0.02]
["SC_1896_A2","La Marina 66",0.28000000000000003]
["SC_1896_A2","Mamonal 66",0.12]
["SC_1896_A2","Manzanillo 66",0.05]
["SC_1896_A2","Membrillal 66",0.18]
["SC_1896_A2","Nv Cospique 110",0.13]
["SC_1896_A2","Pasacaballos 110",0.16]
["SC_1896_A2","Pasacaballos 220",0.09]
["SC_1896_A2","Proelectrica 66",0.24]
["SC_1896_A2","Sabanalarga 220",0.16]
["SC_1896_A2","San Jacinto 66",0.01]
["SC_1896_A2","Ternera 110",0.12]
["SC_1896_A2","Ternera 220",1.05]
["SC_1896_A2","Ternera 66",0.3]
["SC_1896_A2","Toluviejo 110",0.05]
["SC_1896_A2","Toluviejo 220",0.04]
["SC_1896_A2","Turbaco 110",0.08]
["SC_1896_A2","Villa Estrella 66",0.04]
["SC_1896_A2","Zambrano 66",0.01]
["SC_1896_A2","Zaragocilla 66",0.14000000000000001]
["SC_1896_A2","Sierra Flor 110",0.03]
["SC_1896_A2","Coveñas 110",0.02]
["SC_829_A2","Bolivar 500",1.32]
["SC_829_A2","Bolivar 220",1.92]
["SC_829_A2","Cartagena 220",0.68]
["SC_829_A2","Bolivar 34.5",0.1]
["SC_829_A2","Cartagena 66",-1.99]
["SC_829_A2","Pasacaballos 110",7.0000000000000007E-2]
["SC_829_A2","Pasacaballos 220",0.09]
["SC_829_A2","Sabanalarga 220",0.18]
["SC_829_A2","Sabanalarga 500",0.3]
["SC_829_A2","Ternera 110",0.05]
["SC_829_A2","Toluviejo 220",0]
["SC_829_A2","Turbaco 110",0.03]
["SC_2203_A2","Carreto 500",0.01]
["SC_2203_A2","Pasacaballos 220",-0.01]
["SC_2203_A2","Toluviejo 220",0]
["SC_2203_A2","El Carmen 110",0.02]
["SC_2203_A2","Nva Toluviejo 110",0.01]
["SC_2203_A2","Pasacaballos 110",-0.01]
["SC_2203_A2","Carreto 66",0.04]
["SC_2203_A2","El Carmen 66",0.23]
["SC_2203_A2","San Jacinto 66",0.12]
["SC_2203_A2","Zambrano 66",0.03]
["SC_2203_A2","San Jacinto 34.5",-0.03]
["SC_2203_A2","San Jacinto 13.8",0]
["SC_2203_A2","Sierra Flor 110",-0.01]
["SC_2203_A2","Coveñas 110",-0.01]
["SC_170_A1","Bolivar 500",0.1]
["SC_170_A1","Calamar 66",0.01]
["SC_170_A1","Carreto 500",0.32]
["SC_170_A1","Carreto 66",0.22]
["SC_170_A1","Gambote 66",0]
["SC_170_A1","Sabanalarga 220",0.19]
["SC_170_A1","Sabanalarga 500",0.2]
["SC_170_A1","San Jacinto 66",0]
["SC_170_A1","Zambrano 66",0]
["SC_629_A2","Bosque 66",0.21]
["SC_629_A2","Ternera 66",0.18]
["SC_629_A2","Carreto 66",0.59]
["SC_629_A2","Cartagena 66",0.86]
["SC_629_A2","Campestre 66",0.1]
["SC_629_A2","Cartagena 220",0.35]
["SC_629_A2","Candelaria 220",0.32]
["SC_629_A2","La Marina 66",0.09]
["SC_629_A2","Ternera 220",0.89]
["SC_629_A2","Chambacu 66",0.08]
["SC_629_A2","Bgrande 66",7.0000000000000007E-2]
["SC_629_A2","Bolivar 66",0.08]
["SC_629_A2","Membrillal 66",0.05]
["SC_629_A2","Cospique 66",0.04]
["SC_629_A2","Bosque 220",0.62]
["SC_629_A2","Sabanalarga 500",0.28000000000000003]
["SC_629_A2","Pasacaballos 110",0.14000000000000001]
["SC_629_A2","Zaragocilla 66",0.03]
["SC_629_A2","Villa Estrella 66",0.04]
["SC_629_A2","Toluviejo 220",0.02]
["SC_629_A2","Nv Cospique 110",0.05]
["SC_629_A2","Bolivar 500",0.11]
["SC_629_A2","Argos 110",0.1]
["SC_629_A2","Mamonal 66",0.02]
["SC_629_A2","Pasacaballos 220",0.15]
["SC_629_A2","Carreto 500",0.13]
["SC_629_A2","Turbaco 110",0.06]
["SC_629_A2","Ternera 110",0.15]
["SC_629_A2","Bayunca 66",0.01]
["SC_629_A2","Candelaria 110",0.2]
["SC_629_A2","Sierra Flor 110",0.01]
["SC_2256_A2","Calamar 13.8",0.23]
["SC_2256_A2","Calamar 34.5",0.09]
["SC_2256_A2","Calamar 66",0.05]
["SC_2256_A2","Carreto 500",0.01]
["SC_2256_A2","Carreto 66",0.04]
["SC_980_A1","Bosque 220",0.26]
["SC_980_A1","Bolivar 500",0.06]
["SC_980_A1","Bolivar 220",0.82]
["SC_980_A1","Cartagena 220",0.34]
["SC_980_A1","Candelaria 220",0.32]
["SC_980_A1","Carreto 500",0]
["SC_980_A1","Ternera 220",0.28999999999999998]
["SC_980_A1","Pasacaballos 220",0.14000000000000001]
["SC_980_A1","Sabanalarga 220",0.06]
["SC_980_A1","Sabanalarga 500",0.01]
["SC_980_A1","Toluviejo 220",0.03]
["SC_995_A1","Argos 110",-0.03]
["SC_995_A1","Bayunca 66",-0.02]
["SC_995_A1","Bolivar 66",-0.02]
["SC_995_A1","Bosque 220",0.18]
["SC_995_A1","Bosque 66",0.36]
["SC_995_A1","Campestre 66",0.21]
["SC_995_A1","Carreto 500",0.01]
["SC_995_A1","Carreto 66",-0.01]
["SC_995_A1","Cartagena 220",0.41]
["SC_995_A1","Cartagena 66",1.91]
["SC_995_A1","Cospique 66",0.37]
["SC_995_A1","El Carmen 66",-0.01]
["SC_995_A1","Gambote 66",-0.03]
["SC_995_A1","La Marina 66",0.19]
["SC_995_A1","Mamonal 66",0.13]
["SC_995_A1","Manzanillo 66",-0.02]
["SC_995_A1","Membrillal 66",0.81]
["SC_995_A1","Nv Cospique 110",-0.02]
["SC_995_A1","Nva Toluviejo 110",-0.02]
["SC_995_A1","Pasacaballos 110",-0.01]
["SC_995_A1","Pasacaballos 220",0.01]
["SC_995_A1","Proelectrica 66",2.63]
["SC_995_A1","San Jacinto 66",-0.01]
["SC_995_A1","Candelaria 110",-0.02]
["SC_995_A1","Candelaria 220",0.38]
["SC_995_A1","Ternera 220",0.35]
["SC_995_A1","Ternera 66",0.71]
["SC_995_A1","Toluviejo 110",-0.02]
["SC_995_A1","Toluviejo 220",-0.01]
["SC_995_A1","Turbaco 110",-0.03]
["SC_995_A1","Villa Estrella 66",-0.02]
["SC_995_A1","Zambrano 66",0]
["SC_995_A1","Zaragocilla 66",0.1]
["SC_995_A1","Sierra Flor 110",-0.01]
["SC_995_A1","Coveñas 110",-0.01]
["SC_1963_A1","Argos 110",0.1]
["SC_1963_A1","Bayunca 66",7.0000000000000007E-2]
["SC_1963_A1","Bgrande 66",0.22]
["SC_1963_A1","Bolivar 220",0.85]
["SC_1963_A1","Bolivar 500",0.14000000000000001]
["SC_1963_A1","Bolivar 66",0.16]
["SC_1963_A1","Bosque 220",0.21]
["SC_1963_A1","Bosque 66",0.31]
["SC_1963_A1","Calamar 66",0.01]
["SC_1963_A1","Campestre 66",0.2]
["SC_1963_A1","Candelaria 110",0.14000000000000001]
["SC_1963_A1","Candelaria 220",0.27]
["SC_1963_A1","Carreto 500",0.05]
["SC_1963_A1","Carreto 66",0.04]
["SC_1963_A1","Cartagena 220",0.28999999999999998]
["SC_1963_A1","Cartagena 66",0.24]
["SC_1963_A1","Chambacu 66",0.22]
["SC_1963_A1","Cospique 66",0.13]
["SC_1963_A1","El Carmen 110",0.01]
["SC_1963_A1","El Carmen 66",0.02]
["SC_1963_A1","Gambote 66",0.02]
["SC_1963_A1","La Marina 66",0.24]
["SC_1963_A1","Mamonal 66",0.09]
["SC_1963_A1","Manzanillo 66",0.06]
["SC_1963_A1","Membrillal 66",0.14000000000000001]
["SC_1963_A1","Nv Cospique 110",0.11]
["SC_1963_A1","Pasacaballos 110",0.15]
["SC_1963_A1","Pasacaballos 220",0.12]
["SC_1963_A1","Proelectrica 66",0.2]
["SC_1963_A1","Sabanalarga 220",0.18]
["SC_1963_A1","San Jacinto 66",0.01]
["SC_1963_A1","Ternera 110",0.08]
["SC_1963_A1","Ternera 220",0.24]
["SC_1963_A1","Ternera 66",0.23]
["SC_1963_A1","Toluviejo 110",0.06]
["SC_1963_A1","Toluviejo 220",0.04]
["SC_1963_A1","Turbaco 110",7.0000000000000007E-2]
["SC_1963_A1","Villa Estrella 66",0.05]
["SC_1963_A1","Zambrano 66",0.01]
["SC_1963_A1","Zaragocilla 66",0.11]
["SC_1963_A1","Sierra Flor 110",0.04]
["SC_1963_A1","Coveñas 110",0.03]
["SC_170_A2","Bolivar 500",7.0000000000000007E-2]
["SC_170_A2","Calamar 66",0.05]
["SC_170_A2","Carreto 500",0.18]
["SC_170_A2","Carreto 66",1.63]
["SC_170_A2","Gambote 66",0.02]
["SC_170_A2","Sabanalarga 220",0.12]
["SC_170_A2","Sabanalarga 500",0.12]
["SC_170_A2","San Jacinto 66",0.01]
["SC_170_A2","Zambrano 66",0.01]
["SC_2045_A1","Bgrande 66",0.02]
["SC_2045_A1","Cartagena 66",0.08]
["SC_2045_A1","Chambacu 66",0.02]
["SC_2045_A1","Cospique 66",0.06]
["SC_2045_A1","Mamonal 66",0.01]
["SC_2045_A1","Membrillal 66",0.13]
["SC_2045_A1","Proelectrica 66",0.09]
["SC_2045_A1","Zaragocilla 66",0.01]
["SC_2045_A1","Ternera 66",0.06]
["SC_2045_A1","Bosque 66",0.03]
["SC_2045_A1","Bolivar 66",0.01]
["SC_2045_A1","Bayunca 13.8",0.01]
["SC_2045_A1","Membrillal 13.8",0.02]
["SC_2045_A1","Ternera 220",0.01]
["SC_2045_A1","Bosque 220",0.01]
["SC_2045_A1","Candelaria 220",0.02]
["SC_2045_A1","Bolivar 220",0.02]
["SC_2045_A1","Cartagena 220",0.02]
["SC_2045_A1","Bayunca 66",0.01]
["SC_1929_A2","Bolivar 66",0.25]
["SC_1929_A2","Bayunca 13.8",0.03]
["SC_1929_A2","Bayunca 66",0.17]
["SC_1929_A2","Manzanillo 13.8",0.21]
["SC_1929_A2","Villa Estrella 66",0.04]
["SC_1929_A2","Manzanillo 66",0.26]
["SC_1184_A2","Ternera 66",0.03]
["SC_1184_A2","Zaragocilla 66",0.01]
["SC_1184_A2","Cartagena 66",0.06]
["SC_1184_A2","Cospique 66",7.0000000000000007E-2]
["SC_1184_A2","Gambote 66",0]
["SC_1184_A2","La Marina 66",0.05]
["SC_1184_A2","Mamonal 66",0.01]
["SC_1184_A2","Membrillal 66",0.19]
["SC_1184_A2","Proelectrica 66",0.09]
["SC_1184_A2","Villa Estrella 66",0]
["SC_1969_A1","Argos 110",0.1]
["SC_1969_A1","Bayunca 66",7.0000000000000007E-2]
["SC_1969_A1","Bgrande 66",0.22]
["SC_1969_A1","Bolivar 220",0.85]
["SC_1969_A1","Bolivar 500",0.14000000000000001]
["SC_1969_A1","Bolivar 66",0.16]
["SC_1969_A1","Bosque 220",0.21]
["SC_1969_A1","Bosque 66",0.3]
["SC_1969_A1","Calamar 66",0.01]
["SC_1969_A1","Campestre 66",0.21]
["SC_1969_A1","Candelaria 110",0.14000000000000001]
["SC_1969_A1","Candelaria 220",0.27]
["SC_1969_A1","Carreto 500",0.05]
["SC_1969_A1","Carreto 66",0.04]
["SC_1969_A1","Cartagena 220",0.3]
["SC_1969_A1","Cartagena 66",0.23]
["SC_1969_A1","Chambacu 66",0.22]
["SC_1969_A1","Cospique 66",0.14000000000000001]
["SC_1969_A1","El Carmen 110",0.01]
["SC_1969_A1","El Carmen 66",0.01]
["SC_1969_A1","Gambote 66",0.02]
["SC_1969_A1","La Marina 66",0.24]
["SC_1969_A1","Mamonal 66",0.09]
["SC_1969_A1","Manzanillo 66",0.06]
["SC_1969_A1","Membrillal 66",0.14000000000000001]
["SC_1969_A1","Nv Cospique 110",0.11]
["SC_1969_A1","Pasacaballos 110",0.14000000000000001]
["SC_1969_A1","Pasacaballos 220",0.11]
["SC_1969_A1","Proelectrica 66",0.2]
["SC_1969_A1","Sabanalarga 220",0.19]
["SC_1969_A1","San Jacinto 66",0.01]
["SC_1969_A1","Ternera 110",0.08]
["SC_1969_A1","Ternera 220",0.24]
["SC_1969_A1","Ternera 66",0.23]
["SC_1969_A1","Toluviejo 110",0.06]
["SC_1969_A1","Toluviejo 220",0.04]
["SC_1969_A1","Turbaco 110",7.0000000000000007E-2]
["SC_1969_A1","Villa Estrella 66",0.06]
["SC_1969_A1","Zambrano 66",0.01]
["SC_1969_A1","Zaragocilla 66",0.11]
["SC_1969_A1","Sierra Flor 110",0.03]
["SC_1969_A1","Coveñas 110",0.03]
["SC_784_A2","Bayunca 13.8",0.02]
["SC_784_A2","Bayunca 66",0.05]
["SC_784_A2","Bolivar 220",-0.01]
["SC_784_A2","Bolivar 500",0]
["SC_784_A2","Bolivar 66",0.05]
["SC_784_A2","Carreto 500",0]
["SC_784_A2","Carreto 66",0]
["SC_784_A2","Gambote 66",0]
["SC_784_A2","Manzanillo 66",0.03]
["SC_784_A2","Pasacaballos 110",0]
["SC_784_A2","Ternera 66",0]
["SC_784_A2","Sabanalarga 220",0]
["SC_784_A2","Ternera 110",0.72]
["SC_784_A2","Turbaco 110",0]
["SC_784_A2","Villa Estrella 66",0.01]
["SC_2022_A2","Ternera 220",0.01]
["SC_2022_A2","Bosque 220",0.01]
["SC_2022_A2","Candelaria 220",0.01]
["SC_2022_A2","Bolivar 220",0.01]
["SC_2022_A2","Cartagena 220",0.01]
["SC_2022_A2","Bayunca 66",0.03]
["SC_2022_A2","Bgrande 66",0.01]
["SC_2022_A2","Proelectrica 66",0.01]
["SC_2022_A2","Ternera 66",0.01]
["SC_2022_A2","Bosque 66",0]
["SC_2022_A2","Manzanillo 66",0.05]
["SC_2022_A2","Bolivar 66",0.04]
["SC_2022_A2","Bayunca 34.5",0.01]
["SC_2022_A2","Bayunca 13.8",0.03]
["SC_2022_A2","Manzanillo 13.8",0.26]
["SC_2022_A2","Membrillal 13.8",0]
["SC_1688_A2","Bosque 220",0.11]
["SC_1688_A2","Bolivar 500",0.05]
["SC_1688_A2","Bolivar 220",0.2]
["SC_1688_A2","Cartagena 220",0.15]
["SC_1688_A2","Bolivar 66",14.2]
["SC_1688_A2","Manzanillo 66",1.4]
["SC_1688_A2","Calamar 66",0.02]
["SC_1688_A2","El Carmen 66",0.01]
["SC_1688_A2","Gambote 66",0.03]
["SC_1688_A2","Ternera 66",0.6]
["SC_1688_A2","Ternera 220",0.14000000000000001]
["SC_1688_A2","Toluviejo 110",0.04]
["SC_1688_A2","Pasacaballos 220",7.0000000000000007E-2]
["SC_1688_A2","Sabanalarga 220",0.1]
["SC_1688_A2","Zambrano 66",0]
["SC_1688_A2","Coveñas 110",0.02]
["SC_2009_A1","Bolivar 220",0.01]
["SC_2009_A1","Bolivar 66",0.05]
["SC_2009_A1","Manzanillo 66",0.03]
["SC_2009_A1","Bayunca 66",0.05]
["SC_2009_A1","Bayunca 13.8",0.06]
["SC_2009_A1","Bayunca 34.5",0.09]
["SC_2009_A1","Ternera 220",0.01]
["SC_2009_A1","Ternera 66",0.01]
["SC_2009_A1","Villa Estrella 66",0.01]
["SC_2019_A2","Bolivar 220",0.02]
["SC_2019_A2","Bosque 220",0.01]
["SC_2019_A2","Candelaria 220",0.02]
["SC_2019_A2","Cartagena 220",0.02]
["SC_2019_A2","Ternera 220",0.02]
["SC_2019_A2","Bgrande 66",0.05]
["SC_2019_A2","Bosque 66",0.05]
["SC_2019_A2","Campestre 66",0.03]
["SC_2019_A2","Cartagena 66",7.0000000000000007E-2]
["SC_2019_A2","Chambacu 66",0.04]
["SC_2019_A2","Cospique 66",0.05]
["SC_2019_A2","La Marina 66",0.06]
["SC_2019_A2","Mamonal 66",0.01]
["SC_2019_A2","Membrillal 66",0.11]
["SC_2019_A2","Ternera 66",0.05]
["SC_2019_A2","Villa Estrella 66",0.01]
["SC_2019_A2","Zambrano 66",0.01]
["SC_2019_A2","Membrillal 13.8",0.57999999999999996]
["SC_2036_A1","Sabanalarga 220",0.13600000000000001]
["SC_2036_A1","Sabanalarga 500",9.2999999999999999E-2]
["SC_765_A1","Argos 110",0]
["SC_765_A1","Nv Cospique 13.8",0]
["SC_765_A1","Bosque 66",-0.16200000000000001]
["SC_765_A1","Ternera 13.8",0]
["SC_765_A1","Bolivar 13.8",0]
["SC_765_A1","Candelaria 220",2E-3]
["SC_765_A1","Bgrande 66",-8.1000000000000003E-2]
["SC_765_A1","Campestre 66",-7.0000000000000007E-2]
["SC_765_A1","Candelaria 110",1E-3]
["SC_765_A1","Cartagena 66",-9.6000000000000002E-2]
["SC_765_A1","Chambacu 66",-0.08]
["SC_765_A1","Cospique 66",-2.1000000000000001E-2]
["SC_765_A1","La Marina 66",-0.10299999999999999]
["SC_765_A1","Mamonal 66",3.2000000000000001E-2]
["SC_765_A1","Mamonal 13.8",0.216]
["SC_765_A1","Membrillal 66",-2.1999999999999999E-2]
["SC_765_A1","Proelectrica 66",-4.8000000000000001E-2]
["SC_765_A1","Ternera 66",0]
["SC_765_A1","Ternera 220",0]
["SC_765_A1","Nv Cospique 110",0]
["SC_765_A1","Pasacaballos 110",0]
["SC_765_A1","Pasacaballos 220",-1E-3]
["SC_1969_A2","Argos 110",0.12]
["SC_1969_A2","Bayunca 66",0.05]
["SC_1969_A2","Bgrande 66",0.26]
["SC_1969_A2","Bolivar 220",0.3]
["SC_1969_A2","Bolivar 500",7.0000000000000007E-2]
["SC_1969_A2","Bolivar 66",0.12]
["SC_1969_A2","Bosque 220",0.21]
["SC_1969_A2","Bosque 66",0.34]
["SC_1969_A2","Calamar 66",0.01]
["SC_1969_A2","Campestre 66",0.25]
["SC_1969_A2","Candelaria 110",0.19]
["SC_1969_A2","Candelaria 220",0.72]
["SC_1969_A2","Carreto 500",0.04]
["SC_1969_A2","Carreto 66",0.03]
["SC_1969_A2","Cartagena 220",0.54]
["SC_1969_A2","Cartagena 66",0.28999999999999998]
["SC_1969_A2","Chambacu 66",0.26]
["SC_1969_A2","Cospique 66",0.18]
["SC_1969_A2","El Carmen 110",0.01]
["SC_1969_A2","El Carmen 66",0.01]
["SC_1969_A2","Gambote 66",0.03]
["SC_1969_A2","La Marina 66",0.28000000000000003]
["SC_1969_A2","Mamonal 66",0.11]
["SC_1969_A2","Manzanillo 66",0.04]
["SC_1969_A2","Membrillal 66",0.18]
["SC_1969_A2","Nv Cospique 110",0.14000000000000001]
["SC_1969_A2","Pasacaballos 110",0.16]
["SC_1969_A2","Pasacaballos 220",0.09]
["SC_1969_A2","Proelectrica 66",0.24]
["SC_1969_A2","Sabanalarga 220",0.16]
["SC_1969_A2","San Jacinto 66",0.01]
["SC_1969_A2","Ternera 110",0.11]
["SC_1969_A2","Ternera 220",1.05]
["SC_1969_A2","Ternera 66",0.3]
["SC_1969_A2","Toluviejo 110",0.06]
["SC_1969_A2","Toluviejo 220",0.03]
["SC_1969_A2","Turbaco 110",0.08]
["SC_1969_A2","Villa Estrella 66",0.04]
["SC_1969_A2","Zambrano 66",0.01]
["SC_1969_A2","Zaragocilla 66",0.14000000000000001]
["SC_1969_A2","Sierra Flor 110",0.03]
["SC_1969_A2","Coveñas 110",0.02]
["SC_1003_A2","Bolivar 220",0.02]
["SC_1003_A2","Bosque 220",0.01]
["SC_1003_A2","Candelaria 220",0.02]
["SC_1003_A2","Cartagena 220",0.02]
["SC_1003_A2","Pasacaballos 220",0.01]
["SC_1003_A2","Sabanalarga 220",0.01]
["SC_1003_A2","Ternera 220",0.02]
["SC_1003_A2","Argos 110",0.02]
["SC_1003_A2","Bayunca 66",0]
["SC_1003_A2","Bgrande 66",0.01]
["SC_1003_A2","Bolivar 66",0]
["SC_1003_A2","Bosque 66",0.01]
["SC_1003_A2","Calamar 66",0]
["SC_1003_A2","Campestre 66",0.01]
["SC_1003_A2","Candelaria 110",0.02]
["SC_1003_A2","Carreto 66",0]
["SC_1003_A2","Cartagena 66",0.01]
["SC_1003_A2","Chambacu 66",0.01]
["SC_1003_A2","La Marina 66",0.01]
["SC_1003_A2","Nv Cospique 110",0.02]
["SC_1003_A2","Pasacaballos 110",0.05]
["SC_1003_A2","San Jacinto 66",0]
["SC_1003_A2","Ternera 110",0.05]
["SC_1003_A2","Ternera 66",0.01]
["SC_1003_A2","Toluviejo 110",0]
["SC_1003_A2","Turbaco 110",0.08]
["SC_1003_A2","Turbaco 13.8",0]
["SC_1196_A1","Bolivar 500",0.35]
["SC_1196_A1","Carreto 500",0.04]
["SC_1196_A1","Sabanalarga 500",0.16]
["SC_1196_A1","Bolivar 220",0.24]
["SC_1196_A1","Bosque 220",0.06]
["SC_1196_A1","Candelaria 220",0.11]
["SC_1196_A1","Cartagena 220",0.12]
["SC_1196_A1","Pasacaballos 220",0.03]
["SC_1196_A1","Sabanalarga 220",0.19]
["SC_1196_A1","Ternera 220",0.1]
["SC_1196_A1","Argos 110",0.01]
["SC_1196_A1","Bgrande 66",0.04]
["SC_1196_A1","Bolivar 66",0.02]
["SC_1196_A1","Bosque 66",7.0000000000000007E-2]
["SC_1196_A1","Campestre 66",0.03]
["SC_1196_A1","Candelaria 110",0.02]
["SC_1196_A1","Carreto 66",0.03]
["SC_1196_A1","Cartagena 66",0.05]
["SC_1196_A1","Chambacu 66",0.04]
["SC_1196_A1","Cospique 66",0.01]
["SC_1196_A1","La Marina 66",0.05]
["SC_1196_A1","Mamonal 66",0.01]
["SC_1196_A1","Membrillal 66",0.02]
["SC_1196_A1","Nv Cospique 110",0.01]
["SC_1196_A1","Pasacaballos 110",0.02]
["SC_1196_A1","Ternera 110",0.01]
["SC_1196_A1","Ternera 66",0.05]
["SC_1196_A1","Turbaco 110",0.01]
["SC_1196_A1","Villa Estrella 66",0.01]
["SC_1196_A1","Zambrano 66",0.01]
["SC_1741_A2","Bosque 66",0.21]
["SC_1741_A2","Ternera 66",0.18]
["SC_1741_A2","Carreto 66",0.59]
["SC_1741_A2","Cartagena 66",0.86]
["SC_1741_A2","Campestre 66",0.1]
["SC_1741_A2","Cartagena 220",0.35]
["SC_1741_A2","Candelaria 220",0.32]
["SC_1741_A2","La Marina 66",0.09]
["SC_1741_A2","Ternera 220",0.89]
["SC_1741_A2","Chambacu 66",0.08]
["SC_1741_A2","Bgrande 66",7.0000000000000007E-2]
["SC_1741_A2","Bolivar 66",0.08]
["SC_1741_A2","Membrillal 66",0.05]
["SC_1741_A2","Cospique 66",0.04]
["SC_1741_A2","Bosque 220",0.62]
["SC_1741_A2","Sabanalarga 500",0.28000000000000003]
["SC_1741_A2","Pasacaballos 110",0.14000000000000001]
["SC_1741_A2","Zaragocilla 66",0.03]
["SC_1741_A2","Villa Estrella 66",0.04]
["SC_1741_A2","Toluviejo 220",0.02]
["SC_1741_A2","Nv Cospique 110",0.05]
["SC_1741_A2","Bolivar 500",0.11]
["SC_1741_A2","Argos 110",0.1]
["SC_1741_A2","Mamonal 66",0.02]
["SC_1741_A2","Pasacaballos 220",0.15]
["SC_1741_A2","Carreto 500",0.13]
["SC_1741_A2","Turbaco 110",0.06]
["SC_1741_A2","Ternera 110",0.15]
["SC_1741_A2","Bayunca 66",0.01]
["SC_1521_A2","Bolivar 13.8",0.14000000000000001]
["SC_1521_A2","Bosque 3 13.8",7.6999999999999999E-2]
["SC_1521_A2","Bosque 5 13.8",7.3999999999999996E-2]
["SC_1521_A2","Candelaria 13.8",0.17399999999999999]
["SC_1521_A2","El Carmen 13.8",0.02]
["SC_1521_A2","Pasacaballos 1 13.8",0.24299999999999999]
["SC_1521_A2","Pasacaballos 2 13.8",0.24299999999999999]
["SC_1521_A2","Ternera 13.8",0.255]
["SC_1521_A2","Villa Estrella 13.8",1.9410000000000001]
["SC_1521_A2","Bolivar 34.5",6.8000000000000005E-2]
["SC_1521_A2","Bosque 66",0.13700000000000001]
["SC_1521_A2","Bayunca 66",5.0999999999999997E-2]
["SC_1521_A2","Bgrande 66",9.5000000000000001E-2]
["SC_1521_A2","Calamar 66",7.0000000000000001E-3]
["SC_1521_A2","Campestre 66",0.13700000000000001]
["SC_1521_A2","Carreto 66",2.4E-2]
["SC_1521_A2","Cartagena 66",0.11899999999999999]
["SC_1521_A2","Chambacu 66",9.6000000000000002E-2]
["SC_1521_A2","Cospique 66",0.106]
["SC_1521_A2","El Carmen 66",7.0000000000000001E-3]
["SC_1521_A2","Gambote 66",1.9E-2]
["SC_1521_A2","La Marina 66",0.10299999999999999]
["SC_1521_A2","Mamonal 66",6.6000000000000003E-2]
["SC_1521_A2","Membrillal 66",9.4E-2]
["SC_1521_A2","Proelectrica 66",0.113]
["SC_1521_A2","Ternera 66",0.214]
["SC_1521_A2","Bolivar 66",0.13600000000000001]
["SC_1521_A2","Manzanillo 66",4.8000000000000001E-2]
["SC_1521_A2","San Jacinto 66",8.0000000000000002E-3]
["SC_1521_A2","Villa Estrella 66",0.26]
["SC_1521_A2","Zaragocilla 66",8.5999999999999993E-2]
["SC_1521_A2","Zambrano 66",5.0000000000000001E-3]
["SC_1521_A2","Argos 110",3.2000000000000001E-2]
["SC_1521_A2","El Carmen 110",4.0000000000000001E-3]
["SC_1521_A2","Nva Toluviejo 110",0.02]
["SC_1521_A2","Nv Cospique 110",3.4000000000000002E-2]
["SC_1521_A2","Pasacaballos 110",4.4999999999999998E-2]
["SC_1521_A2","Ternera 110",2.7E-2]
["SC_1521_A2","Turbaco 110",2.3E-2]
["SC_1521_A2","Bosque 220",5.5E-2]
["SC_1521_A2","Candelaria 220",7.6999999999999999E-2]
["SC_1521_A2","Cartagena 220",7.5999999999999998E-2]
["SC_1521_A2","Ternera 220",7.1999999999999995E-2]
["SC_1521_A2","Pasacaballos 220",0.03]
["SC_1521_A2","Sabanalarga 220",0.05]
["SC_1521_A2","Bolivar 220",8.3000000000000004E-2]
["SC_1521_A2","Toluviejo 220",1.0999999999999999E-2]
["SC_1521_A2","Carreto 500",1.2999999999999999E-2]
["SC_1521_A2","Bolivar 500",2.4E-2]
["SC_1521_A2","Sierra Flor 110",1.4999999999999999E-2]
["SC_1307_A1","Bolivar 13.8",0.23]
["SC_1307_A1","Bosque 3 13.8",0.29299999999999998]
["SC_1307_A1","Bosque 5 13.8",0.29399999999999998]
["SC_1307_A1","Candelaria 13.8",0.69]
["SC_1307_A1","El Carmen 13.8",0.10299999999999999]
["SC_1307_A1","Pasacaballos 1 13.8",2.5249999999999999]
["SC_1307_A1","Pasacaballos 2 13.8",2.5249999999999999]
["SC_1307_A1","Ternera 13.8",0.41599999999999998]
["SC_1307_A1","Bolivar 34.5",0.318]
["SC_1307_A1","Bosque 66",0.38800000000000001]
["SC_1307_A1","Bayunca 66",8.5999999999999993E-2]
["SC_1307_A1","Bgrande 66",0.26600000000000001]
["SC_1307_A1","Calamar 66",2.5999999999999999E-2]
["SC_1307_A1","Campestre 66",0.28000000000000003]
["SC_1307_A1","Carreto 66",8.6999999999999994E-2]
["SC_1307_A1","Cartagena 66",0.27500000000000002]
["SC_1307_A1","Chambacu 66",0.26700000000000002]
["SC_1307_A1","Cospique 66",0.191]
["SC_1307_A1","El Carmen 66",3.5999999999999997E-2]
["SC_1307_A1","Gambote 66",4.1000000000000002E-2]
["SC_1307_A1","La Marina 66",0.28399999999999997]
["SC_1307_A1","Mamonal 66",0.13]
["SC_1307_A1","Membrillal 66",0.189]
["SC_1307_A1","Proelectrica 66",0.23799999999999999]
["SC_1307_A1","Ternera 66",0.33300000000000002]
["SC_1307_A1","Bolivar 66",0.23100000000000001]
["SC_1307_A1","Manzanillo 66",8.1000000000000003E-2]
["SC_1307_A1","San Jacinto 66",3.5999999999999997E-2]
["SC_1307_A1","Villa Estrella 66",0.16500000000000001]
["SC_1307_A1","Zaragocilla 66",0.16]
["SC_1307_A1","Zambrano 66",2.1000000000000001E-2]
["SC_1307_A1","Argos 110",0.215]
["SC_1307_A1","El Carmen 110",0.03]
["SC_1307_A1","Nva Toluviejo 110",0.17299999999999999]
["SC_1307_A1","Pasacaballos 110",0.9]
["SC_1307_A1","Ternera 110",0.36699999999999999]
["SC_1307_A1","Turbaco 110",0.36299999999999999]
["SC_1307_A1","Bosque 220",0.19900000000000001]
["SC_1307_A1","Candelaria 220",0.32200000000000001]
["SC_1307_A1","Cartagena 220",0.311]
["SC_1307_A1","Ternera 220",0.29399999999999998]
["SC_1307_A1","Pasacaballos 220",0.26200000000000001]
["SC_1307_A1","Bolivar 220",0.34399999999999997]
["SC_1307_A1","Toluviejo 220",0.11700000000000001]
["SC_1307_A1","Carreto 500",5.8000000000000003E-2]
["SC_1307_A1","Bolivar 500",0.10199999999999999]
["SC_1307_A1","Sierra Flor 110",0.125]
["SC_1428_A1","Bolivar 500",0.35]
["SC_1428_A1","Carreto 500",0.04]
["SC_1428_A1","Sabanalarga 500",0.16]
["SC_1428_A1","Bolivar 220",0.24]
["SC_1428_A1","Bosque 220",0.06]
["SC_1428_A1","Candelaria 220",0.11]
["SC_1428_A1","Cartagena 220",0.12]
["SC_1428_A1","Pasacaballos 220",0.03]
["SC_1428_A1","Sabanalarga 220",0.19]
["SC_1428_A1","Ternera 220",0.1]
["SC_1428_A1","Toluviejo 220",0]
["SC_1428_A1","Argos 110",0.01]
["SC_1428_A1","Bayunca 66",0]
["SC_1428_A1","Bgrande 66",0.04]
["SC_1428_A1","Bolivar 66",0.02]
["SC_1428_A1","Bosque 66",7.0000000000000007E-2]
["SC_1428_A1","Calamar 66",0]
["SC_1428_A1","Campestre 66",0.03]
["SC_1428_A1","Candelaria 110",0.02]
["SC_1428_A1","Carreto 66",0.03]
["SC_1428_A1","Cartagena 66",0.05]
["SC_1428_A1","Chambacu 66",0.04]
["SC_1428_A1","Cospique 66",0.01]
["SC_1428_A1","El Carmen 110",0]
["SC_1428_A1","El Carmen 66",0]
["SC_1428_A1","Gambote 66",0]
["SC_1428_A1","La Marina 66",0.05]
["SC_1428_A1","Mamonal 66",0.01]
["SC_1428_A1","Manzanillo 66",0]
["SC_1428_A1","Membrillal 66",0.02]
["SC_1428_A1","Nva Toluviejo 110",0]
["SC_1428_A1","Nv Cospique 110",0.01]
["SC_1428_A1","Pasacaballos 110",0.02]
["SC_1428_A1","San Jacinto 66",0]
["SC_1428_A1","Ternera 110",0.01]
["SC_1428_A1","Ternera 66",0.05]
["SC_1428_A1","Toluviejo 110",0]
["SC_1428_A1","Turbaco 110",0.01]
["SC_1428_A1","Villa Estrella 66",0.01]
["SC_1428_A1","Zambrano 66",0]
["SC_969_A1","Bolivar 220",0.02]
["SC_969_A1","Bosque 220",0.02]
["SC_969_A1","Candelaria 220",0.02]
["SC_969_A1","Cartagena 220",0.02]
["SC_969_A1","Pasacaballos 220",0]
["SC_969_A1","Sabanalarga 220",0.01]
["SC_969_A1","Ternera 220",0.02]
["SC_969_A1","Bgrande 66",0.03]
["SC_969_A1","Bolivar 66",0.01]
["SC_969_A1","Bosque 66",0.05]
["SC_969_A1","Calamar 66",0]
["SC_969_A1","Campestre 66",0.05]
["SC_969_A1","Cartagena 66",0.05]
["SC_969_A1","Chambacu 66",0.03]
["SC_969_A1","Cospique 66",0.03]
["SC_969_A1","La Marina 66",0.04]
["SC_969_A1","Mamonal 66",0.01]
["SC_969_A1","Manzanillo 66",0]
["SC_969_A1","Membrillal 66",0.02]
["SC_969_A1","Ternera 66",0.14000000000000001]
["SC_969_A1","Villa Estrella 66",0.02]
["SC_969_A1","Zambrano 66",0.02]
["SC_969_A1","Ternera 13.8",0.6]
["SC_969_A2","Bolivar 220",0.02]
["SC_969_A2","Bosque 220",0.02]
["SC_969_A2","Candelaria 220",0.03]
["SC_969_A2","Cartagena 220",0.02]
["SC_969_A2","Pasacaballos 220",0]
["SC_969_A2","Sabanalarga 220",0.01]
["SC_969_A2","Ternera 220",0.03]
["SC_969_A2","Bgrande 66",0.03]
["SC_969_A2","Bolivar 66",0.01]
["SC_969_A2","Bosque 66",0.05]
["SC_969_A2","Calamar 66",0]
["SC_969_A2","Campestre 66",0.05]
["SC_969_A2","Cartagena 66",0.04]
["SC_969_A2","Chambacu 66",0.03]
["SC_969_A2","Cospique 66",0.03]
["SC_969_A2","La Marina 66",0.04]
["SC_969_A2","Mamonal 66",0.01]
["SC_969_A2","Manzanillo 66",0]
["SC_969_A2","Membrillal 66",0.02]
["SC_969_A2","Ternera 66",0.13]
["SC_969_A2","Villa Estrella 66",0.02]
["SC_969_A2","Zambrano 66",0.02]
["SC_969_A2","Ternera 13.8",0.08]
["SC_2009_A2","Bolivar 220",0.01]
["SC_2009_A2","Bolivar 66",0.05]
["SC_2009_A2","Manzanillo 66",0.03]
["SC_2009_A2","Bayunca 66",0.05]
["SC_2009_A2","Bayunca 13.8",0.23]
["SC_2009_A2","Bayunca 34.5",0.02]
["SC_2009_A2","Ternera 220",0.01]
["SC_2009_A2","Ternera 66",0.01]
["SC_2009_A2","Villa Estrella 66",0.01]
["SC_1260_A1","Bolivar 500",0.17]
["SC_1260_A1","Carreto 500",0.02]
["SC_1260_A1","Sabanalarga 500",0.08]
["SC_1260_A1","Bolivar 220",0.12]
["SC_1260_A1","Bosque 220",0.03]
["SC_1260_A1","Candelaria 220",0.06]
["SC_1260_A1","Cartagena 220",0.06]
["SC_1260_A1","Pasacaballos 220",0.01]
["SC_1260_A1","Sabanalarga 220",0.1]
["SC_1260_A1","Ternera 220",0.05]
["SC_1260_A1","Toluviejo 220",0]
["SC_1260_A1","Argos 110",0.01]
["SC_1260_A1","Bayunca 66",0]
["SC_1260_A1","Bgrande 66",0.02]
["SC_1260_A1","Bolivar 66",0.01]
["SC_1260_A1","Bosque 66",0.04]
["SC_1260_A1","Calamar 66",0]
["SC_1260_A1","Campestre 66",0.02]
["SC_1260_A1","Candelaria 110",0.01]
["SC_1260_A1","Carreto 66",0.02]
["SC_1260_A1","Cartagena 66",0.03]
["SC_1260_A1","Chambacu 66",0.02]
["SC_1260_A1","Cospique 66",0.01]
["SC_1260_A1","Gambote 66",0]
["SC_1260_A1","La Marina 66",0.03]
["SC_1260_A1","Mamonal 66",0.01]
["SC_1260_A1","Manzanillo 66",0.01]
["SC_1260_A1","Membrillal 66",0.01]
["SC_1260_A1","Nv Cospique 110",0.01]
["SC_1260_A1","Pasacaballos 110",0.01]
["SC_1260_A1","San Jacinto 66",0.01]
["SC_1260_A1","Ternera 110",0]
["SC_1260_A1","Ternera 66",0.02]
["SC_1260_A1","Toluviejo 110",0]
["SC_1260_A1","Turbaco 110",0]
["SC_1260_A1","Villa Estrella 66",0.01]
["SC_1260_A1","Zambrano 66",0]
["SC_2122_A1","Sabanalarga 500",0.08]
["SC_2122_A1","Bolivar 500",0.12]
["SC_2122_A1","Sabanalarga 220",0.15]
["SC_2122_A1","Bolivar 220",0.89]
["SC_1753_A1","Bolivar 220",0.1]
["SC_1753_A1","Bolivar 500",0.02]
["SC_1753_A1","Carreto 500",0.01]
["SC_1753_A1","Pasacaballos 110",0.06]
["SC_1753_A1","Pasacaballos 220",0.14000000000000001]
["SC_1753_A1","Sabanalarga 220",0.03]
["SC_1753_A1","Sabanalarga 500",0.02]
["SC_1753_A1","Ternera 110",0.01]
["SC_1753_A1","Ternera 220",0]
["SC_1753_A1","Toluviejo 220",0.01]
["SC_1753_A1","Turbaco 110",0.02]
["SC_1521_A1","Bolivar 13.8",0.28299999999999997]
["SC_1521_A1","Bosque 3 13.8",7.1999999999999995E-2]
["SC_1521_A1","Bosque 5 13.8",7.1999999999999995E-2]
["SC_1521_A1","Candelaria 13.8",0.16400000000000001]
["SC_1521_A1","El Carmen 13.8",1.9E-2]
["SC_1521_A1","Pasacaballos 1 13.8",0.255]
["SC_1521_A1","Pasacaballos 2 13.8",0.255]
["SC_1521_A1","Ternera 13.8",0.14499999999999999]
["SC_1521_A1","Villa Estrella 13.8",0.27500000000000002]
["SC_1521_A1","Bolivar 34.5",7.5999999999999998E-2]
["SC_1521_A1","Bosque 66",0.106]
["SC_1521_A1","Bayunca 66",0.10100000000000001]
["SC_1521_A1","Bgrande 66",7.2999999999999995E-2]
["SC_1521_A1","Calamar 66",6.0000000000000001E-3]
["SC_1521_A1","Campestre 66",8.8999999999999996E-2]
["SC_1521_A1","Carreto 66",2.1000000000000001E-2]
["SC_1521_A1","Cartagena 66",8.3000000000000004E-2]
["SC_1521_A1","Chambacu 66",7.2999999999999995E-2]
["SC_1521_A1","Cospique 66",6.3E-2]
["SC_1521_A1","El Carmen 66",6.0000000000000001E-3]
["SC_1521_A1","Gambote 66",1.2E-2]
["SC_1521_A1","La Marina 66",7.9000000000000001E-2]
["SC_1521_A1","Mamonal 66",4.1000000000000002E-2]
["SC_1521_A1","Membrillal 66",0.06]
["SC_1521_A1","Proelectrica 66",7.4999999999999997E-2]
["SC_1521_A1","Ternera 66",0.121]
["SC_1521_A1","Bolivar 66",0.27300000000000002]
["SC_1521_A1","Manzanillo 66",9.5000000000000001E-2]
["SC_1521_A1","San Jacinto 66",7.0000000000000001E-3]
["SC_1521_A1","Villa Estrella 66",0.108]
["SC_1521_A1","Zaragocilla 66",5.1999999999999998E-2]
["SC_1521_A1","Zambrano 66",4.0000000000000001E-3]
["SC_1521_A1","Argos 110",3.2000000000000001E-2]
["SC_1521_A1","El Carmen 110",4.0000000000000001E-3]
["SC_1521_A1","Nva Toluviejo 110",2.1000000000000001E-2]
["SC_1521_A1","Nv Cospique 110",3.4000000000000002E-2]
["SC_1521_A1","Pasacaballos 110",4.5999999999999999E-2]
["SC_1521_A1","Ternera 110",2.5999999999999999E-2]
["SC_1521_A1","Turbaco 110",2.3E-2]
["SC_1521_A1","Bosque 220",5.1999999999999998E-2]
["SC_1521_A1","Candelaria 220",7.1999999999999995E-2]
["SC_1521_A1","Cartagena 220",7.2999999999999995E-2]
["SC_1521_A1","Ternera 220",6.6000000000000003E-2]
["SC_1521_A1","Pasacaballos 220",3.2000000000000001E-2]
["SC_1521_A1","Sabanalarga 220",5.3999999999999999E-2]
["SC_1521_A1","Bolivar 220",9.2999999999999999E-2]
["SC_1521_A1","Toluviejo 220",1.2E-2]
["SC_1521_A1","Carreto 500",1.4E-2]
["SC_1521_A1","Bolivar 500",2.5999999999999999E-2]
["SC_1521_A1","Sierra Flor 110",1.6E-2]
["SC_1976_A1","Argos 110",0.1]
["SC_1976_A1","Bayunca 66",7.0000000000000007E-2]
["SC_1976_A1","Bgrande 66",0.22]
["SC_1976_A1","Bolivar 220",0.85]
["SC_1976_A1","Bolivar 500",0.14000000000000001]
["SC_1976_A1","Bolivar 66",0.16]
["SC_1976_A1","Bosque 220",0.21]
["SC_1976_A1","Bosque 66",0.3]
["SC_1976_A1","Calamar 66",0.01]
["SC_1976_A1","Campestre 66",0.21]
["SC_1976_A1","Candelaria 110",0.14000000000000001]
["SC_1976_A1","Candelaria 220",0.27]
["SC_1976_A1","Carreto 500",0.05]
["SC_1976_A1","Carreto 66",0.04]
["SC_1976_A1","Cartagena 220",0.3]
["SC_1976_A1","Cartagena 66",0.23]
["SC_1976_A1","Chambacu 66",0.22]
["SC_1976_A1","Cospique 66",0.14000000000000001]
["SC_1976_A1","El Carmen 110",0.01]
["SC_1976_A1","El Carmen 66",0.01]
["SC_1976_A1","Gambote 66",0.02]
["SC_1976_A1","La Marina 66",0.24]
["SC_1976_A1","Mamonal 66",0.09]
["SC_1976_A1","Manzanillo 66",0.06]
["SC_1976_A1","Membrillal 66",0.14000000000000001]
["SC_1976_A1","Nv Cospique 110",0.11]
["SC_1976_A1","Pasacaballos 110",0.14000000000000001]
["SC_1976_A1","Pasacaballos 220",0.11]
["SC_1976_A1","Proelectrica 66",0.2]
["SC_1976_A1","Sabanalarga 220",0.19]
["SC_1976_A1","San Jacinto 66",0.01]
["SC_1976_A1","Ternera 110",0.08]
["SC_1976_A1","Ternera 220",0.24]
["SC_1976_A1","Ternera 66",0.23]
["SC_1976_A1","Toluviejo 110",0.06]
["SC_1976_A1","Toluviejo 220",0.04]
["SC_1976_A1","Turbaco 110",7.0000000000000007E-2]
["SC_1976_A1","Villa Estrella 66",0.06]
["SC_1976_A1","Zambrano 66",0.01]
["SC_1976_A1","Zaragocilla 66",0.11]
["SC_1976_A1","Sierra Flor 110",0.03]
["SC_1976_A1","Coveñas 110",0.03]
["SC_2019_A1","Bolivar 220",0.02]
["SC_2019_A1","Bosque 220",0.01]
["SC_2019_A1","Candelaria 220",0.02]
["SC_2019_A1","Cartagena 220",0.02]
["SC_2019_A1","Pasacaballos 220",0.01]
["SC_2019_A1","Sabanalarga 220",0.01]
["SC_2019_A1","Ternera 220",0.02]
["SC_2019_A1","Argos 110",0.06]
["SC_2019_A1","Bgrande 66",0.01]
["SC_2019_A1","Bosque 66",0.01]
["SC_2019_A1","Candelaria 110",0.05]
["SC_2019_A1","Cartagena 66",0.01]
["SC_2019_A1","Chambacu 66",0.01]
["SC_2019_A1","La Marina 66",0.01]
["SC_2019_A1","Nv Cospique 110",7.0000000000000007E-2]
["SC_2019_A1","Pasacaballos 110",0.03]
["SC_2019_A1","Ternera 110",0.01]
["SC_2019_A1","Ternera 66",0.01]
["SC_2019_A1","Turbaco 110",0.01]
["SC_2019_A1","Nv Cospique 13.8",0.57999999999999996]
["SC_2068_A2","Argos 110",0]
["SC_2068_A2","Bosque 220",0]
["SC_2068_A2","Bosque 66",0]
["SC_2068_A2","Bolivar 500",0]
["SC_2068_A2","Candelaria 220",0]
["SC_2068_A2","Bolivar 66",0]
["SC_2068_A2","Cartagena 220",0]
["SC_2068_A2","Bayunca 66",0]
["SC_2068_A2","Bgrande 66",0]
["SC_2068_A2","Calamar 34.5",0]
["SC_2068_A2","Calamar 66",0.2]
["SC_2068_A2","Campestre 66",0]
["SC_2068_A2","Candelaria 13.8",0]
["SC_2068_A2","Carreto 500",0]
["SC_2068_A2","Carreto 66",0]
["SC_2068_A2","Cartagena 66",0]
["SC_2068_A2","Chambacu 66",0]
["SC_2068_A2","Cospique 66",0]
["SC_2068_A2","El Carmen 110",0]
["SC_2068_A2","El Carmen 66",0]
["SC_2068_A2","Gambote 66",0]
["SC_2068_A2","La Marina 66",0]
["SC_2068_A2","Mamonal 66",0]
["SC_2068_A2","Membrillal 66",0]
["SC_2068_A2","Nva Toluviejo 110",0]
["SC_2068_A2","Pasacaballos 110",0]
["SC_2068_A2","Pasacaballos 220",0]
["SC_2068_A2","Sabanalarga 220",0]
["SC_2068_A2","Sabanalarga 500",0]
["SC_2068_A2","San Jacinto 66",0]
["SC_2068_A2","Ternera 110",0]
["SC_2068_A2","Toluviejo 220",0]
["SC_2068_A2","Turbaco 110",0]
["SC_2068_A2","Villa Estrella 66",0]
["SC_2068_A2","Zaragocilla 66",0]
["SC_2068_A2","Zambrano 66",0]
["SC_1939_A1","Bolivar 66",0.3]
["SC_1939_A1","Bosque 220",0.01]
["SC_1939_A1","Ternera 220",0.02]
["SC_1939_A1","Bolivar 220",0.08]
["SC_1939_A1","Candelaria 220",0.03]
["SC_1939_A1","Cartagena 220",0.03]
["SC_1939_A1","Sabanalarga 220",0.01]
["SC_1939_A1","Bolivar 500",0.01]
["SC_1939_A1","Sabanalarga 500",0.01]
["SC_1801_A2","Bolivar 66",0.12]
["SC_1801_A2","Bayunca 13.8",0.05]
["SC_1801_A2","Bayunca 66",0.08]
["SC_1801_A2","Manzanillo 13.8",0.11]
["SC_1801_A2","Villa Estrella 66",0.01]
["SC_1801_A2","Manzanillo 66",0.14000000000000001]
["SC_1290_A2","Bolivar 500",0.01]
["SC_1290_A2","Bosque 220",0]
["SC_1290_A2","Bolivar 220",0.03]
["SC_1290_A2","Candelaria 220",0]
["SC_1290_A2","Cartagena 220",0.02]
["SC_1290_A2","Pasacaballos 220",0.01]
["SC_1290_A2","Toluviejo 220",0]
["SC_1290_A2","Argos 110",0]
["SC_1290_A2","Nva Toluviejo 110",0]
["SC_1290_A2","Pasacaballos 110",0]
["SC_1290_A2","Ternera 110",0]
["SC_1290_A2","Turbaco 110",0]
["SC_1290_A2","Bosque 66",0]
["SC_1290_A2","Bayunca 66",7.0000000000000007E-2]
["SC_1290_A2","Bolivar 66",0.11]
["SC_1290_A2","Campestre 66",0]
["SC_1290_A2","Cartagena 66",-0.01]
["SC_1290_A2","Manzanillo 66",0.11]
["SC_1290_A2","Villa Estrella 66",0]
["SC_1290_A2","Manzanillo 13.8",0.55000000000000004]
["SC_1945_A1","Bolivar 500",0.52]
["SC_1945_A1","Carreto 500",0.06]
["SC_1945_A1","Sabanalarga 500",0.24]
["SC_1945_A1","Bolivar 220",0.35]
["SC_1945_A1","Bosque 220",0.09]
["SC_1945_A1","Candelaria 220",0.17]
["SC_1945_A1","Cartagena 220",0.18]
["SC_1945_A1","Pasacaballos 220",0.04]
["SC_1945_A1","Sabanalarga 220",0.28999999999999998]
["SC_1945_A1","Ternera 220",0.15]
["SC_1945_A1","Toluviejo 220",0.01]
["SC_1945_A1","Argos 110",0.02]
["SC_1945_A1","Bayunca 66",0]
["SC_1945_A1","Bgrande 66",0.06]
["SC_1945_A1","Bolivar 66",0.04]
["SC_1945_A1","Bosque 66",0.11]
["SC_1945_A1","Calamar 66",0]
["SC_1945_A1","Campestre 66",0.05]
["SC_1945_A1","Candelaria 110",0.02]
["SC_1945_A1","Carreto 66",0.04]
["SC_1945_A1","Cartagena 66",0.08]
["SC_1945_A1","Chambacu 66",0.06]
["SC_1945_A1","Cospique 66",0.02]
["SC_1945_A1","El Carmen 110",0]
["SC_1945_A1","El Carmen 66",0]
["SC_1945_A1","Gambote 66",0]
["SC_1945_A1","La Marina 66",0.08]
["SC_1945_A1","Mamonal 66",0.01]
["SC_1945_A1","Manzanillo 66",0]
["SC_1945_A1","Membrillal 66",0.02]
["SC_1945_A1","Nva Toluviejo 110",0.01]
["SC_1945_A1","Nv Cospique 110",0.02]
["SC_1945_A1","Pasacaballos 110",0.03]
["SC_1945_A1","San Jacinto 66",0]
["SC_1945_A1","Ternera 110",0.01]
["SC_1945_A1","Ternera 66",7.0000000000000007E-2]
["SC_1945_A1","Toluviejo 110",0.01]
["SC_1945_A1","Turbaco 110",0.01]
["SC_1945_A1","Villa Estrella 66",0.02]
["SC_1945_A1","Zambrano 66",0]
["SC_1896_A1","Argos 110",0.1]
["SC_1896_A1","Bayunca 66",7.0000000000000007E-2]
["SC_1896_A1","Bgrande 66",0.22]
["SC_1896_A1","Bolivar 220",0.85]
["SC_1896_A1","Bolivar 500",0.14000000000000001]
["SC_1896_A1","Bolivar 66",0.16]
["SC_1896_A1","Bosque 220",0.21]
["SC_1896_A1","Bosque 66",0.31]
["SC_1896_A1","Calamar 66",0.01]
["SC_1896_A1","Campestre 66",0.2]
["SC_1896_A1","Candelaria 110",0.14000000000000001]
["SC_1896_A1","Candelaria 220",0.27]
["SC_1896_A1","Carreto 500",0.05]
["SC_1896_A1","Carreto 66",0.04]
["SC_1896_A1","Cartagena 220",0.28999999999999998]
["SC_1896_A1","Cartagena 66",0.24]
["SC_1896_A1","Chambacu 66",0.22]
["SC_1896_A1","Cospique 66",0.13]
["SC_1896_A1","El Carmen 110",0.01]
["SC_1896_A1","El Carmen 66",0.02]
["SC_1896_A1","Gambote 66",0.02]
["SC_1896_A1","La Marina 66",0.24]
["SC_1896_A1","Mamonal 66",0.09]
["SC_1896_A1","Manzanillo 66",0.06]
["SC_1896_A1","Membrillal 66",0.14000000000000001]
["SC_1896_A1","Nv Cospique 110",0.11]
["SC_1896_A1","Pasacaballos 110",0.15]
["SC_1896_A1","Pasacaballos 220",0.12]
["SC_1896_A1","Proelectrica 66",0.2]
["SC_1896_A1","Sabanalarga 220",0.18]
["SC_1896_A1","San Jacinto 66",0.01]
["SC_1896_A1","Ternera 110",0.08]
["SC_1896_A1","Ternera 220",0.24]
["SC_1896_A1","Ternera 66",0.23]
["SC_1896_A1","Toluviejo 110",0.06]
["SC_1896_A1","Toluviejo 220",0.04]
["SC_1896_A1","Turbaco 110",7.0000000000000007E-2]
["SC_1896_A1","Villa Estrella 66",0.05]
["SC_1896_A1","Zambrano 66",0.01]
["SC_1896_A1","Zaragocilla 66",0.11]
["SC_1896_A1","Sierra Flor 110",0.04]
["SC_1896_A1","Coveñas 110",0.03]
["SC_1754_A1","Bolivar 220",0.28999999999999998]
["SC_1754_A1","Bolivar 500",0.05]
["SC_1754_A1","Carreto 500",0.01]
["SC_1754_A1","Pasacaballos 110",0.02]
["SC_1754_A1","Pasacaballos 220",0.03]
["SC_1754_A1","Sabanalarga 220",0.08]
["SC_1754_A1","Sabanalarga 500",0.04]
["SC_1754_A1","Ternera 110",0.01]
["SC_1754_A1","Ternera 220",0]
["SC_1754_A1","Toluviejo 220",0]
["SC_1754_A1","Turbaco 110",0.01]
["SC_1754_A2","Bolivar 220",0.11]
["SC_1754_A2","Bolivar 500",0.13]
["SC_1754_A2","Carreto 500",0.03]
["SC_1754_A2","Pasacaballos 110",0.01]
["SC_1754_A2","Pasacaballos 220",0.01]
["SC_1754_A2","Sabanalarga 220",0.1]
["SC_1754_A2","Sabanalarga 500",7.0000000000000007E-2]
["SC_1754_A2","Ternera 110",0]
["SC_1754_A2","Ternera 220",0]
["SC_1754_A2","Toluviejo 220",0]
["SC_1754_A2","Turbaco 110",0]
["SC_1209_A2","Bolivar 500",0.26]
["SC_1209_A2","Carreto 500",0.03]
["SC_1209_A2","Sabanalarga 500",0.12]
["SC_1209_A2","Bolivar 220",0.17]
["SC_1209_A2","Bosque 220",0.04]
["SC_1209_A2","Candelaria 220",0.08]
["SC_1209_A2","Cartagena 220",0.08]
["SC_1209_A2","Pasacaballos 220",0.02]
["SC_1209_A2","Sabanalarga 220",0.13]
["SC_1209_A2","Ternera 220",7.0000000000000007E-2]
["SC_1209_A2","Argos 110",0.01]
["SC_1209_A2","Bgrande 66",0.03]
["SC_1209_A2","Bolivar 66",0.02]
["SC_1209_A2","Bosque 66",0.05]
["SC_1209_A2","Campestre 66",0.02]
["SC_1209_A2","Candelaria 110",0.01]
["SC_1209_A2","Carreto 66",0.02]
["SC_1209_A2","Cartagena 66",0.03]
["SC_1209_A2","Chambacu 66",0.03]
["SC_1209_A2","Cospique 66",0.01]
["SC_1209_A2","La Marina 66",0.04]
["SC_1209_A2","Membrillal 66",0.01]
["SC_1209_A2","Nv Cospique 110",0.01]
["SC_1209_A2","Pasacaballos 110",0.01]
["SC_1209_A2","Ternera 66",0.03]
["SC_1209_A2","Villa Estrella 66",0.01]
["SC_1209_A2","Zambrano 66",0.01]
["SC_2034_A2","Bolivar 500",0.95]
["SC_2034_A2","Bolivar 220",3.8]
["SC_2034_A2","Cartagena 220",2.77]
["SC_2034_A2","Pasacaballos 220",1.29]
["SC_2034_A2","Toluviejo 220",0.56999999999999995]
["SC_2034_A2","Argos 110",1.19]
["SC_2034_A2","Nva Toluviejo 110",0.95]
["SC_2034_A2","Pasacaballos 110",1.75]
["SC_2034_A2","Ternera 110",1.04]
["SC_2034_A2","Turbaco 110",0.86]
["SC_2034_A2","Bayunca 66",10.52]
["SC_2034_A2","Bolivar 66",10.52]
["SC_2034_A2","Campestre 66",2.39]
["SC_2034_A2","Cartagena 66",2.4300000000000002]
["SC_2034_A2","Manzanillo 66",8.1199999999999992]
["SC_2034_A2","Villa Estrella 66",3.56]
["SC_2034_A2","Manzanillo 13.8",24.7]
["SC_960_A1","Calamar 34.5",0.03]
["SC_960_A1","Calamar 66",0.03]
["SC_960_A1","El Carmen 110",0]
["SC_960_A1","Toluviejo 110",0.02]
["SC_960_A1","Toluviejo 220",0]
["SC_960_A1","Sierra Flor 110",0.01]
["SC_970_A2","Bolivar 220",0.02]
["SC_970_A2","Bosque 220",0.02]
["SC_970_A2","Candelaria 220",0.03]
["SC_970_A2","Cartagena 220",0.02]
["SC_970_A2","Pasacaballos 220",0]
["SC_970_A2","Sabanalarga 220",0.01]
["SC_970_A2","Ternera 220",0.03]
["SC_970_A2","Bayunca 66",0]
["SC_970_A2","Bgrande 66",0.03]
["SC_970_A2","Bolivar 66",0.01]
["SC_970_A2","Bosque 66",0.05]
["SC_970_A2","Calamar 66",0]
["SC_970_A2","Campestre 66",0.05]
["SC_970_A2","Cartagena 66",0.04]
["SC_970_A2","Chambacu 66",0.03]
["SC_970_A2","Cospique 66",0.03]
["SC_970_A2","La Marina 66",0.04]
["SC_970_A2","Mamonal 66",0.01]
["SC_970_A2","Manzanillo 66",0]
["SC_970_A2","Membrillal 66",0.02]
["SC_970_A2","Ternera 66",0.13]
["SC_970_A2","Villa Estrella 66",0.02]
["SC_970_A2","Zambrano 66",0.02]
["SC_501_A2","Bolivar 220",0.81]
["SC_501_A2","Bolivar 500",0.13]
["SC_501_A2","Bosque 220",0.22]
["SC_501_A2","Carreto 500",0.03]
["SC_501_A2","Carreto 66",0]
["SC_501_A2","Pasacaballos 110",7.0000000000000007E-2]
["SC_501_A2","Pasacaballos 220",0.09]
["SC_501_A2","Sabanalarga 220",0.2]
["SC_501_A2","Sabanalarga 500",0.09]
["SC_501_A2","Candelaria 220",0.39]
["SC_501_A2","Ternera 110",0.01]
["SC_501_A2","Ternera 220",0.33]
["SC_501_A2","Toluviejo 220",0]
["SC_501_A2","Turbaco 110",0.02]
["SC_2022_A1","Ternera 220",0.01]
["SC_2022_A1","Bosque 220",0.01]
["SC_2022_A1","Candelaria 220",0.01]
["SC_2022_A1","Bolivar 220",0.02]
["SC_2022_A1","Cartagena 220",0.01]
["SC_2022_A1","Bayunca 66",0.05]
["SC_2022_A1","Bgrande 66",0.01]
["SC_2022_A1","Proelectrica 66",0.01]
["SC_2022_A1","Ternera 66",0.01]
["SC_2022_A1","Bosque 66",0]
["SC_2022_A1","Manzanillo 66",0.03]
["SC_2022_A1","Bolivar 66",0.04]
["SC_2022_A1","Bayunca 34.5",0.01]
["SC_2022_A1","Bayunca 13.8",0.28000000000000003]
["SC_2022_A1","Manzanillo 13.8",0.03]
["SC_2022_A1","Membrillal 13.8",0]
["SC_2256_A1","Calamar 13.8",0.22]
["SC_2256_A1","Calamar 34.5",0.06]
["SC_2256_A1","Calamar 66",0.05]
["SC_2256_A1","Carreto 500",0.01]
["SC_2256_A1","Carreto 66",0.04]
["SC_1241_A1","Bolivar 220",0.02]
["SC_1241_A1","Bosque 220",0.01]
["SC_1241_A1","Candelaria 220",0.02]
["SC_1241_A1","Cartagena 220",0.02]
["SC_1241_A1","Pasacaballos 220",0.01]
["SC_1241_A1","Sabanalarga 220",0.01]
["SC_1241_A1","Ternera 220",0.02]
["SC_1241_A1","Argos 110",0.01]
["SC_1241_A1","Bgrande 66",0.01]
["SC_1241_A1","Bosque 66",0.01]
["SC_1241_A1","Candelaria 110",0.01]
["SC_1241_A1","Cartagena 66",0.01]
["SC_1241_A1","La Marina 66",0.01]
["SC_1241_A1","Nv Cospique 110",0.02]
["SC_1241_A1","Pasacaballos 110",0.04]
["SC_1241_A1","Ternera 110",0.04]
["SC_1241_A1","Ternera 66",0.01]
["SC_1241_A1","Turbaco 110",0.06]
["SC_831_A2","Argos 110",0]
["SC_831_A2","Bayunca 66",0]
["SC_831_A2","Bgrande 66",0]
["SC_831_A2","Bolivar 220",0]
["SC_831_A2","Bolivar 500",0]
["SC_831_A2","Bolivar 66",0]
["SC_831_A2","Bosque 220",0]
["SC_831_A2","Bosque 66",0]
["SC_831_A2","Calamar 66",0]
["SC_831_A2","Campestre 66",0]
["SC_831_A2","Carreto 500",0]
["SC_831_A2","Carreto 66",0]
["SC_831_A2","Cartagena 66",0]
["SC_831_A2","Chambacu 66",0]
["SC_831_A2","Cospique 66",0]
["SC_831_A2","El Carmen 110",0]
["SC_831_A2","El Carmen 66",0]
["SC_831_A2","Gambote 66",0]
["SC_831_A2","La Marina 66",0]
["SC_831_A2","Mamonal 66",0]
["SC_831_A2","Manzanillo 66",0]
["SC_831_A2","Membrillal 66",0]
["SC_831_A2","Nv Cospique 110",0]
["SC_831_A2","Nva Toluviejo 110",0]
["SC_831_A2","Pasacaballos 110",0]
["SC_831_A2","Pasacaballos 220",0]
["SC_831_A2","Proelectrica 66",0]
["SC_831_A2","San Jacinto 66",0]
["SC_831_A2","Cartagena 220",0]
["SC_831_A2","Candelaria 110",0]
["SC_831_A2","Candelaria 220",0]
["SC_831_A2","Ternera 110",0]
["SC_831_A2","Ternera 220",0]
["SC_831_A2","Ternera 66",0]
["SC_831_A2","Toluviejo 110",0]
["SC_831_A2","Turbaco 110",0]
["SC_831_A2","Villa Estrella 66",0]
["SC_831_A2","Zambrano 34.5",0]
["SC_831_A2","Zambrano 66",0]
["SC_831_A2","Zaragocilla 66",0]
["SC_1184_A1","Ternera 66",0.05]
["SC_1184_A1","Zaragocilla 66",0.01]
["SC_1184_A1","Cartagena 66",0.05]
["SC_1184_A1","Cospique 66",0.01]
["SC_1184_A1","Gambote 66",0]
["SC_1184_A1","La Marina 66",0.04]
["SC_1184_A1","Mamonal 66",0.22]
["SC_1184_A1","Membrillal 66",0.02]
["SC_1184_A1","Proelectrica 66",7.0000000000000007E-2]
["SC_1184_A1","Villa Estrella 66",0.01]
["SC_1841_A1","Argos 110",0.1]
["SC_1841_A1","Bayunca 66",0.43]
["SC_1841_A1","Bgrande 66",0.22]
["SC_1841_A1","Bolivar 220",0.38]
["SC_1841_A1","Bolivar 500",0.09]
["SC_1841_A1","Bolivar 66",1.05]
["SC_1841_A1","Bosque 220",0.19]
["SC_1841_A1","Bosque 66",0.3]
["SC_1841_A1","Calamar 66",0.01]
["SC_1841_A1","Campestre 66",0.21]
["SC_1841_A1","Candelaria 110",0.14000000000000001]
["SC_1841_A1","Candelaria 220",0.26]
["SC_1841_A1","Carreto 500",0.05]
["SC_1841_A1","Carreto 66",0.04]
["SC_1841_A1","Cartagena 220",0.26]
["SC_1841_A1","Cartagena 66",0.23]
["SC_1841_A1","Chambacu 66",0.22]
["SC_1841_A1","Cospique 66",0.14000000000000001]
["SC_1841_A1","El Carmen 110",0.01]
["SC_1841_A1","El Carmen 66",0.01]
["SC_1841_A1","Gambote 66",0.02]
["SC_1841_A1","La Marina 66",0.24]
["SC_1841_A1","Mamonal 66",0.09]
["SC_1841_A1","Manzanillo 66",0.4]
["SC_1841_A1","Membrillal 66",0.14000000000000001]
["SC_1841_A1","Nv Cospique 110",0.11]
["SC_1841_A1","Pasacaballos 110",0.14000000000000001]
["SC_1841_A1","Pasacaballos 220",0.11]
["SC_1841_A1","Proelectrica 66",0.2]
["SC_1841_A1","Sabanalarga 220",0.18]
["SC_1841_A1","San Jacinto 66",0.01]
["SC_1841_A1","Ternera 110",0.08]
["SC_1841_A1","Ternera 220",0.23]
["SC_1841_A1","Ternera 66",0.23]
["SC_1841_A1","Toluviejo 110",0.06]
["SC_1841_A1","Toluviejo 220",0.04]
["SC_1841_A1","Turbaco 110",7.0000000000000007E-2]
["SC_1841_A1","Villa Estrella 66",0.36]
["SC_1841_A1","Zambrano 66",0.01]
["SC_1841_A1","Zaragocilla 66",0.11]
["SC_1841_A1","Sierra Flor 110",0.03]
["SC_1841_A1","Coveñas 110",0.03]
["SC_2048_A1","Cartagena 220",0.01]
["SC_2048_A1","Bayunca 66",0.03]
["SC_2048_A1","Cartagena 66",0.01]
["SC_2048_A1","Ternera 66",0.01]
["SC_2048_A1","Bosque 66",0.01]
["SC_2048_A1","Manzanillo 66",0.02]
["SC_2048_A1","Bolivar 66",0.03]
["SC_2048_A1","Bayunca 34.5",0.01]
["SC_2048_A1","Bayunca 13.8",0.17]
["SC_2048_A1","Manzanillo 13.8",0.02]
["SC_2122_A2","Sabanalarga 500",0.19]
["SC_2122_A2","Bolivar 500",0.44]
["SC_2122_A2","Sabanalarga 220",0.14000000000000001]
["SC_2122_A2","Bolivar 220",0.17]
["SC_2036_A2","Sabanalarga 220",0.125]
["SC_2036_A2","Sabanalarga 500",0.14499999999999999]
["SC_2048_A2","Cartagena 220",0.01]
["SC_2048_A2","Bayunca 66",0.02]
["SC_2048_A2","Cartagena 66",0.01]
["SC_2048_A2","Ternera 66",0.01]
["SC_2048_A2","Bosque 66",0.01]
["SC_2048_A2","Manzanillo 66",0.03]
["SC_2048_A2","Bolivar 66",0.03]
["SC_2048_A2","Bayunca 34.5",0.01]
["SC_2048_A2","Bayunca 13.8",0.02]
["SC_2048_A2","Manzanillo 13.8",0.16]
["SC_1688_A1","Bosque 220",0.28000000000000003]
["SC_1688_A1","Bolivar 500",0.14000000000000001]
["SC_1688_A1","Bolivar 220",0.8]
["SC_1688_A1","Cartagena 220",0.38]
["SC_1688_A1","Bolivar 66",0.34]
["SC_1688_A1","Manzanillo 66",0.12]
["SC_1688_A1","Calamar 66",0.04]
["SC_1688_A1","El Carmen 66",0.03]
["SC_1688_A1","Gambote 66",0.06]
["SC_1688_A1","Ternera 66",0.48]
["SC_1688_A1","Ternera 220",0.34]
["SC_1688_A1","Toluviejo 110",0.1]
["SC_1688_A1","Pasacaballos 220",0.18]
["SC_1688_A1","Sabanalarga 220",0.27]
["SC_1688_A1","Zambrano 66",0.02]
["SC_1688_A1","Coveñas 110",0.06]
["SC_629_A1","Bosque 66",0.06]
["SC_629_A1","Ternera 66",0.05]
["SC_629_A1","Carreto 66",0.12]
["SC_629_A1","Cartagena 66",0.13]
["SC_629_A1","Campestre 66",0.1]
["SC_629_A1","Cartagena 220",0.1]
["SC_629_A1","Candelaria 220",0.09]
["SC_629_A1","La Marina 66",0.03]
["SC_629_A1","Ternera 220",0.3]
["SC_629_A1","Chambacu 66",0.02]
["SC_629_A1","Bgrande 66",0.02]
["SC_629_A1","Bolivar 66",0.02]
["SC_629_A1","Membrillal 66",0.02]
["SC_629_A1","Cospique 66",0.01]
["SC_629_A1","Bosque 220",0.2]
["SC_629_A1","Sabanalarga 500",0.48]
["SC_629_A1","Pasacaballos 110",0.06]
["SC_629_A1","Zaragocilla 66",0.01]
["SC_629_A1","Villa Estrella 66",0.01]
["SC_629_A1","Toluviejo 220",0.01]
["SC_629_A1","Nv Cospique 110",0.04]
["SC_629_A1","Bolivar 500",0.22]
["SC_629_A1","Argos 110",0.06]
["SC_629_A1","Mamonal 66",0.01]
["SC_629_A1","Pasacaballos 220",0.05]
["SC_629_A1","Carreto 500",0.12]
["SC_629_A1","Turbaco 110",0.02]
["SC_629_A1","Ternera 110",0.67]
["SC_629_A1","Candelaria 110",0.1]
["SC_629_A1","Sierra Flor 110",0.01]
["SC_1607_A2","Bolivar 500",0.14000000000000001]
["SC_1607_A2","Carreto 500",0.02]
["SC_1607_A2","Sabanalarga 500",0.08]
["SC_1607_A2","Bolivar 220",0.98]
["SC_1607_A2","Cartagena 220",0.44]
["SC_1607_A2","Candelaria 220",0.4]
["SC_1607_A2","Pasacaballos 220",0.09]
["SC_1607_A2","Sabanalarga 220",0.18]
["SC_1607_A2","Toluviejo 220",0.01]
["SC_1705_A1","Bolivar 13.8",0.03]
["SC_1705_A1","Bosque 3 13.8",0.03]
["SC_1705_A1","Bosque 5 13.8",0.03]
["SC_1705_A1","Candelaria 13.8",0.08]
["SC_1705_A1","El Carmen 13.8",0.02]
["SC_1705_A1","Mamonal 13.8",0.02]
["SC_1705_A1","Pasacaballos 1 13.8",0.42]
["SC_1705_A1","Pasacaballos 2 13.8",0.42]
["SC_1705_A1","Pasacaballos 13.8",0.64]
["SC_1705_A1","Ternera 13.8",0.05]
["SC_1705_A1","Bolivar 34.5",0.03]
["SC_1705_A1","Bayunca 66",0.01]
["SC_1705_A1","Bgrande 66",0.03]
["SC_1705_A1","Bolivar 66",0.02]
["SC_1705_A1","Bosque 66",0.04]
["SC_1705_A1","Calamar 66",0]
["SC_1705_A1","Campestre 66",0.03]
["SC_1705_A1","Carreto 66",0.01]
["SC_1705_A1","Cartagena 66",0.03]
["SC_1705_A1","Chambacu 66",0.03]
["SC_1705_A1","Cospique 66",0.02]
["SC_1705_A1","La Marina 66",0.03]
["SC_1705_A1","Mamonal 66",0.02]
["SC_1705_A1","Manzanillo 66",0.01]
["SC_1705_A1","Membrillal 66",0.02]
["SC_1705_A1","Proelectrica 66",0.03]
["SC_1705_A1","San Jacinto 66",0.01]
["SC_1705_A1","Ternera 66",0.04]
["SC_1705_A1","Villa Estrella 66",0.02]
["SC_1705_A1","Zambrano 66",0.01]
["SC_1705_A1","Zaragocilla 66",0.02]
["SC_1705_A1","Argos 110",0.05]
["SC_1705_A1","El Carmen 110",0.01]
["SC_1705_A1","Nv Cospique 110",0.05]
["SC_1705_A1","Nva Toluviejo 110",0.02]
["SC_1705_A1","Pasacaballos 110",0.1]
["SC_1705_A1","Ternera 110",0.05]
["SC_1705_A1","Turbaco 110",0.05]
["SC_1705_A1","Bolivar 220",0.05]
["SC_1705_A1","Bosque 220",0.02]
["SC_1705_A1","Candelaria 220",0.04]
["SC_1705_A1","Cartagena 220",0.03]
["SC_1705_A1","Pasacaballos 220",0.03]
["SC_1705_A1","Sabanalarga 220",0.03]
["SC_1705_A1","Ternera 220",0.04]
["SC_1705_A1","Toluviejo 220",0.02]
["SC_1705_A1","Bolivar 500",0.01]
["SC_1705_A1","Carreto 500",0.01]
["SC_1705_A1","Sierra Flor 110",0.02]
["SC_1915_A1","Carreto 500",0]
["SC_1915_A1","Carreto 66",0.2]
["SC_1915_A1","Calamar 66",0]
["SC_1915_A1","San Jacinto 66",0.4]
["SC_1915_A1","El Carmen 66",0.3]
["SC_1915_A1","Gambote 66",0]
["SC_1101_A2","Bayunca 13.8",0.62]
["SC_1101_A2","Bolivar 66",0.11]
["SC_1101_A2","Bayunca 66",0.11]
["SC_1101_A2","Villa Estrella 66",0.01]
["SC_1101_A2","Manzanillo 66",0.06]
["SC_2146_A2","Bolivar 500",9.4E-2]
["SC_2146_A2","Bolivar 220",8.3000000000000004E-2]
["SC_2146_A2","Carreto 500",0.02]
["SC_2146_A2","Ternera 220",4.1000000000000002E-2]
["SC_2146_A2","Pasacaballos 110",7.0000000000000001E-3]
["SC_2146_A2","Pasacaballos 220",8.0000000000000002E-3]
["SC_2146_A2","Sabanalarga 220",7.3999999999999996E-2]
["SC_2146_A2","Sabanalarga 500",5.2999999999999999E-2]
["SC_2146_A2","Ternera 110",2E-3]
["SC_2146_A2","Toluviejo 220",3.0000000000000001E-3]
["SC_2146_A2","Turbaco 110",3.0000000000000001E-3]
["SC_980_A2","Bosque 220",0.12]
["SC_980_A2","Bolivar 500",0.17]
["SC_980_A2","Bolivar 220",0.22]
["SC_980_A2","Cartagena 220",0.15]
["SC_980_A2","Candelaria 220",0.15]
["SC_980_A2","Carreto 500",0.04]
["SC_980_A2","Ternera 220",0.14000000000000001]
["SC_980_A2","Pasacaballos 220",7.0000000000000007E-2]
["SC_980_A2","Sabanalarga 220",0.12]
["SC_980_A2","Sabanalarga 500",0.08]
["SC_980_A2","Toluviejo 220",0.03]
["SC_1945_A2","Bolivar 500",0.18]
["SC_1945_A2","Carreto 500",0.03]
["SC_1945_A2","Sabanalarga 500",0.12]
["SC_1945_A2","Bolivar 220",1.17]
["SC_1945_A2","Bosque 220",0.28000000000000003]
["SC_1945_A2","Candelaria 220",0.51]
["SC_1945_A2","Cartagena 220",0.56999999999999995]
["SC_1945_A2","Pasacaballos 220",0.12]
["SC_1945_A2","Sabanalarga 220",0.26]
["SC_1945_A2","Ternera 220",0.44]
["SC_1945_A2","Toluviejo 220",0.01]
["SC_1945_A2","Argos 110",0.06]
["SC_1945_A2","Bayunca 66",0.02]
["SC_1945_A2","Bgrande 66",0.2]
["SC_1945_A2","Bolivar 66",0.12]
["SC_1945_A2","Bosque 66",0.35]
["SC_1945_A2","Calamar 66",0]
["SC_1945_A2","Campestre 66",0.15]
["SC_1945_A2","Candelaria 110",7.0000000000000007E-2]
["SC_1945_A2","Carreto 66",0.03]
["SC_1945_A2","Cartagena 66",0.24]
["SC_1945_A2","Chambacu 66",0.19]
["SC_1945_A2","Cospique 66",7.0000000000000007E-2]
["SC_1945_A2","El Carmen 110",0]
["SC_1945_A2","El Carmen 66",0]
["SC_1945_A2","Gambote 66",0]
["SC_1945_A2","La Marina 66",0.25]
["SC_1945_A2","Mamonal 66",0.03]
["SC_1945_A2","Manzanillo 66",0.01]
["SC_1945_A2","Membrillal 66",7.0000000000000007E-2]
["SC_1945_A2","Nva Toluviejo 110",0.01]
["SC_1945_A2","Nv Cospique 110",0.06]
["SC_1945_A2","Pasacaballos 110",0.08]
["SC_1945_A2","San Jacinto 66",0]
["SC_1945_A2","Ternera 110",0.03]
["SC_1945_A2","Ternera 66",0.22]
["SC_1945_A2","Toluviejo 110",0.01]
["SC_1945_A2","Turbaco 110",0.03]
["SC_1945_A2","Villa Estrella 66",0.05]
["SC_1945_A2","Zambrano 66",0]
["SC_1832_A2","Argos 110",0.13]
["SC_1832_A2","Bayunca 66",0.05]
["SC_1832_A2","Bgrande 66",0.25]
["SC_1832_A2","Bolivar 220",0.31]
["SC_1832_A2","Bolivar 500",7.0000000000000007E-2]
["SC_1832_A2","Bolivar 66",0.12]
["SC_1832_A2","Bosque 220",0.21]
["SC_1832_A2","Bosque 66",0.35]
["SC_1832_A2","Calamar 66",0.01]
["SC_1832_A2","Campestre 66",0.25]
["SC_1832_A2","Candelaria 110",0.18]
["SC_1832_A2","Candelaria 220",0.73]
["SC_1832_A2","Carreto 500",0.04]
["SC_1832_A2","Carreto 66",0.03]
["SC_1832_A2","Cartagena 220",0.54]
["SC_1832_A2","Cartagena 66",0.28999999999999998]
["SC_1832_A2","Chambacu 66",0.25]
["SC_1832_A2","Cospique 66",0.17]
["SC_1832_A2","El Carmen 110",0.01]
["SC_1832_A2","El Carmen 66",0.01]
["SC_1832_A2","Gambote 66",0.02]
["SC_1832_A2","La Marina 66",0.28000000000000003]
["SC_1832_A2","Mamonal 66",0.12]
["SC_1832_A2","Manzanillo 66",0.05]
["SC_1832_A2","Membrillal 66",0.18]
["SC_1832_A2","Nv Cospique 110",0.13]
["SC_1832_A2","Pasacaballos 110",0.16]
["SC_1832_A2","Pasacaballos 220",0.09]
["SC_1832_A2","Proelectrica 66",0.24]
["SC_1832_A2","Sabanalarga 220",0.16]
["SC_1832_A2","San Jacinto 66",0.01]
["SC_1832_A2","Ternera 110",0.12]
["SC_1832_A2","Ternera 220",1.05]
["SC_1832_A2","Ternera 66",0.3]
["SC_1832_A2","Toluviejo 110",0.05]
["SC_1832_A2","Toluviejo 220",0.04]
["SC_1832_A2","Turbaco 110",0.08]
["SC_1832_A2","Villa Estrella 66",0.04]
["SC_1832_A2","Zambrano 66",0.01]
["SC_1832_A2","Zaragocilla 66",0.14000000000000001]
["SC_1832_A2","Sierra Flor 110",0.03]
["SC_1832_A2","Coveñas 110",0.02]
["SC_1929_A1","Bolivar 66",0.24]
["SC_1929_A1","Bayunca 13.8",0.03]
["SC_1929_A1","Bayunca 66",0.16]
["SC_1929_A1","Manzanillo 13.8",1.26]
["SC_1929_A1","Villa Estrella 66",0.03]
["SC_1929_A1","Manzanillo 66",0.25]
["SC_2047_A2","Bosque 220",0.01]
["SC_2047_A2","Bolivar 220",0.01]
["SC_2047_A2","Candelaria 220",0.01]
["SC_2047_A2","Cartagena 220",0.01]
["SC_2047_A2","Ternera 220",0.01]
["SC_2047_A2","Bosque 66",0.01]
["SC_2047_A2","Bayunca 66",0.05]
["SC_2047_A2","Bgrande 66",0.01]
["SC_2047_A2","Bolivar 66",0.06]
["SC_2047_A2","Cartagena 66",0.01]
["SC_2047_A2","Chambacu 66",0]
["SC_2047_A2","Manzanillo 66",0.08]
["SC_2047_A2","Membrillal 66",0.01]
["SC_2047_A2","Proelectrica 66",0]
["SC_2047_A2","Ternera 66",0.01]
["SC_2047_A2","Villa Estrella 66",0.01]
["SC_2047_A2","Zaragocilla 66",0]
["SC_2047_A2","Bayunca 34.5",0.02]
["SC_2047_A2","Bayunca 13.8",0.05]
["SC_2047_A2","Manzanillo 13.8",0.46]
["SC_2203_A1","Carreto 500",0.01]
["SC_2203_A1","Pasacaballos 220",-0.01]
["SC_2203_A1","Toluviejo 220",0]
["SC_2203_A1","El Carmen 110",0]
["SC_2203_A1","Nva Toluviejo 110",0]
["SC_2203_A1","Pasacaballos 110",-0.01]
["SC_2203_A1","Carreto 66",0.09]
["SC_2203_A1","El Carmen 66",0.1]
["SC_2203_A1","San Jacinto 66",0.24]
["SC_2203_A1","Zambrano 66",0.02]
["SC_2203_A1","San Jacinto 34.5",-0.03]
["SC_2203_A1","San Jacinto 13.8",0]
["SC_2203_A1","Sierra Flor 110",-0.01]
["SC_2203_A1","Coveñas 110",-0.01]
["SC_2047_A1","Bosque 220",0.01]
["SC_2047_A1","Bolivar 220",0.02]
["SC_2047_A1","Candelaria 220",0.02]
["SC_2047_A1","Cartagena 220",0.02]
["SC_2047_A1","Ternera 220",0.01]
["SC_2047_A1","Bosque 66",0.01]
["SC_2047_A1","Bayunca 66",7.0000000000000007E-2]
["SC_2047_A1","Bgrande 66",0.01]
["SC_2047_A1","Bolivar 66",0.09]
["SC_2047_A1","Cartagena 66",0.01]
["SC_2047_A1","Chambacu 66",0.01]
["SC_2047_A1","Manzanillo 66",0.12]
["SC_2047_A1","Membrillal 66",0.01]
["SC_2047_A1","Proelectrica 66",0]
["SC_2047_A1","Ternera 66",0.01]
["SC_2047_A1","Villa Estrella 66",0.01]
["SC_2047_A1","Zaragocilla 66",0]
["SC_2047_A1","Bayunca 34.5",0.02]
["SC_2047_A1","Bayunca 13.8",7.0000000000000007E-2]
["SC_2047_A1","Manzanillo 13.8",0.12]
["SC_2179_A2","Bolivar 500",0.63]
["SC_2179_A2","Carreto 500",0.05]
["SC_2179_A2","Sabanalarga 500",0.16]
["SC_2179_A2","Bolivar 220",0.11]
["SC_2179_A2","Pasacaballos 220",0.03]
["SC_2179_A2","Sabanalarga 220",0.18]
["SC_2179_A2","Toluviejo 220",0]
["SC_2179_A2","Argos 110",0.01]
["SC_2179_A2","Candelaria 110",0.01]
["SC_2179_A2","El Carmen 110",0]
["SC_2179_A2","Nva Toluviejo 110",0.01]
["SC_2179_A2","Pasacaballos 110",0.02]
["SC_2179_A2","Ternera 110",0.01]
["SC_2179_A2","Turbaco 110",0.01]
["SC_2179_A2","Bayunca 66",0]
["SC_2179_A2","Bgrande 66",0.02]
["SC_2179_A2","Bolivar 66",0.24]
["SC_2179_A2","Bosque 66",0.06]
["SC_2179_A2","Calamar 66",0]
["SC_2179_A2","Campestre 66",0.03]
["SC_2179_A2","Carreto 66",0.03]
["SC_2179_A2","Cartagena 66",0.03]
["SC_2179_A2","Chambacu 66",0.02]
["SC_2179_A2","Cospique 66",0.01]
["SC_2179_A2","El Carmen 66",0]
["SC_2179_A2","Gambote 66",0]
["SC_2179_A2","La Marina 66",0.03]
["SC_2179_A2","Mamonal 66",0.01]
["SC_2179_A2","Membrillal 66",0.01]
["SC_2179_A2","Proelectrica 66",0.02]
["SC_2179_A2","San Jacinto 66",0]
["SC_2179_A2","Villa Estrella 66",0.01]
["SC_2179_A2","Zambrano 66",0]
["SC_2179_A2","Zaragocilla 66",0.01]
["SC_2179_A2","Coveñas 110",0]
["SC_537_A1","Bolivar 220",1.95]
["SC_537_A1","Bolivar 500",0.35]
["SC_537_A1","Bosque 220",0.44]
["SC_537_A1","Carreto 500",0.08]
["SC_537_A1","Cartagena 220",1.22]
["SC_537_A1","Pasacaballos 220",4.24]
["SC_537_A1","Candelaria 220",1.1200000000000001]
["SC_537_A1","Ternera 220",0.95]
["SC_537_A1","Toluviejo 220",0.12]
["SC_2045_A2","Bgrande 66",0.02]
["SC_2045_A2","Cartagena 66",7.0000000000000007E-2]
["SC_2045_A2","Chambacu 66",0.01]
["SC_2045_A2","Cospique 66",0.05]
["SC_2045_A2","Mamonal 66",0.01]
["SC_2045_A2","Membrillal 66",0.11]
["SC_2045_A2","Proelectrica 66",0.08]
["SC_2045_A2","Zaragocilla 66",0.01]
["SC_2045_A2","Ternera 66",0.05]
["SC_2045_A2","Bosque 66",0.02]
["SC_2045_A2","Bolivar 66",0.01]
["SC_2045_A2","Bayunca 13.8",0]
["SC_2045_A2","Membrillal 13.8",0.53]
["SC_2045_A2","Ternera 220",0.01]
["SC_2045_A2","Bosque 220",0.01]
["SC_2045_A2","Candelaria 220",0.02]
["SC_2045_A2","Bolivar 220",0.02]
["SC_2045_A2","Cartagena 220",0.02]
["SC_2045_A2","Bayunca 66",0.01]
["SC_1832_A1","Argos 110",0.1]
["SC_1832_A1","Bayunca 66",7.0000000000000007E-2]
["SC_1832_A1","Bgrande 66",0.22]
["SC_1832_A1","Bolivar 220",0.85]
["SC_1832_A1","Bolivar 500",0.14000000000000001]
["SC_1832_A1","Bolivar 66",0.16]
["SC_1832_A1","Bosque 220",0.21]
["SC_1832_A1","Bosque 66",0.31]
["SC_1832_A1","Calamar 66",0.01]
["SC_1832_A1","Campestre 66",0.2]
["SC_1832_A1","Candelaria 110",0.14000000000000001]
["SC_1832_A1","Candelaria 220",0.27]
["SC_1832_A1","Carreto 500",0.05]
["SC_1832_A1","Carreto 66",0.04]
["SC_1832_A1","Cartagena 220",0.28999999999999998]
["SC_1832_A1","Cartagena 66",0.24]
["SC_1832_A1","Chambacu 66",0.22]
["SC_1832_A1","Cospique 66",0.13]
["SC_1832_A1","El Carmen 110",0.01]
["SC_1832_A1","El Carmen 66",0.02]
["SC_1832_A1","Gambote 66",0.02]
["SC_1832_A1","La Marina 66",0.24]
["SC_1832_A1","Mamonal 66",0.09]
["SC_1832_A1","Manzanillo 66",0.06]
["SC_1832_A1","Membrillal 66",0.14000000000000001]
["SC_1832_A1","Nv Cospique 110",0.11]
["SC_1832_A1","Pasacaballos 110",0.15]
["SC_1832_A1","Pasacaballos 220",0.12]
["SC_1832_A1","Proelectrica 66",0.2]
["SC_1832_A1","Sabanalarga 220",0.18]
["SC_1832_A1","San Jacinto 66",0.01]
["SC_1832_A1","Ternera 110",0.08]
["SC_1832_A1","Ternera 220",0.24]
["SC_1832_A1","Ternera 66",0.23]
["SC_1832_A1","Toluviejo 110",0.06]
["SC_1832_A1","Toluviejo 220",0.04]
["SC_1832_A1","Turbaco 110",7.0000000000000007E-2]
["SC_1832_A1","Villa Estrella 66",0.05]
["SC_1832_A1","Zambrano 66",0.01]
["SC_1832_A1","Zaragocilla 66",0.11]
["SC_1832_A1","Sierra Flor 110",0.04]
["SC_1832_A1","Coveñas 110",0.03]
["SC_631_A1","Carreto 500",0.02]
["SC_631_A1","Cartagena 220",0.01]
["SC_631_A1","Candelaria 220",0.01]
["SC_631_A1","Bolivar 220",0.01]
["SC_631_A1","Sabanalarga 220",0.01]
["SC_631_A1","Sabanalarga 500",0.01]
["SC_631_A1","Bolivar 500",0.01]
["SC_631_A1","Ternera 220",0.01]
["SC_631_A1","Toluviejo 110",0.06]
["SC_631_A1","Toluviejo 220",0.02]
["SC_631_A1","Zaragocilla 66",0.09]
["SC_631_A1","El Carmen 66",0.43]
["SC_631_A1","El Carmen 13.8",1.1000000000000001]
["SC_631_A1","El Carmen 110",0.12]
["SC_631_A1","San Jacinto 66",0.22]
["SC_631_A1","Carreto 66",0.1]
["SC_829_A1","Bolivar 500",1.32]
["SC_829_A1","Bolivar 220",1.87]
["SC_829_A1","Cartagena 220",0.67]
["SC_829_A1","Bolivar 34.5",0.1]
["SC_829_A1","Cartagena 66",-1.99]
["SC_829_A1","Pasacaballos 110",0.22]
["SC_829_A1","Pasacaballos 220",0.48]
["SC_829_A1","Sabanalarga 220",0.17]
["SC_829_A1","Sabanalarga 500",0.3]
["SC_829_A1","Ternera 110",0.08]
["SC_829_A1","Toluviejo 220",0.04]
["SC_829_A1","Turbaco 110",7.0000000000000007E-2]
["SC_1241_A2","Bolivar 220",0.02]
["SC_1241_A2","Bosque 220",0.01]
["SC_1241_A2","Candelaria 220",0.02]
["SC_1241_A2","Cartagena 220",0.02]
["SC_1241_A2","Pasacaballos 220",0.01]
["SC_1241_A2","Sabanalarga 220",0.01]
["SC_1241_A2","Ternera 220",0.02]
["SC_1241_A2","Argos 110",0.02]
["SC_1241_A2","Bgrande 66",0.01]
["SC_1241_A2","Bosque 66",0.01]
["SC_1241_A2","Campestre 66",0.01]
["SC_1241_A2","Candelaria 110",0.02]
["SC_1241_A2","Cartagena 66",0.01]
["SC_1241_A2","Chambacu 66",0.01]
["SC_1241_A2","La Marina 66",0.01]
["SC_1241_A2","Nv Cospique 110",0.02]
["SC_1241_A2","Pasacaballos 110",0.05]
["SC_1241_A2","Ternera 110",0.05]
["SC_1241_A2","Ternera 66",0.01]
["SC_1241_A2","Turbaco 110",0.08]
["SC_1525_A2","Bolivar 500",0.01]
["SC_1525_A2","Sabanalarga 500",0.01]
["SC_1525_A2","Bosque 220",0.02]
["SC_1525_A2","Bolivar 220",0.1]
["SC_1525_A2","Ternera 220",7.0000000000000007E-2]
["SC_1525_A2","Pasacaballos 220",0.05]
["SC_1525_A2","Sabanalarga 220",0.02]
["SC_1525_A2","Nva Toluviejo 110",-0.01]
["SC_1525_A2","Pasacaballos 110",0.34]
["SC_1525_A2","Ternera 110",0.01]
["SC_1525_A2","Turbaco 110",0.04]
["SC_1525_A2","Carreto 66",-0.01]
["SC_1260_A2","Bolivar 500",0.06]
["SC_1260_A2","Carreto 500",0.01]
["SC_1260_A2","Sabanalarga 500",0.04]
["SC_1260_A2","Bolivar 220",0.39]
["SC_1260_A2","Bosque 220",0.1]
["SC_1260_A2","Candelaria 220",0.17]
["SC_1260_A2","Cartagena 220",0.19]
["SC_1260_A2","Pasacaballos 220",0.04]
["SC_1260_A2","Sabanalarga 220",0.09]
["SC_1260_A2","Ternera 220",0.15]
["SC_1260_A2","Toluviejo 220",0]
["SC_1260_A2","Argos 110",0.02]
["SC_1260_A2","Bayunca 66",0.01]
["SC_1260_A2","Bgrande 66",7.0000000000000007E-2]
["SC_1260_A2","Bolivar 66",0.04]
["SC_1260_A2","Bosque 66",0.12]
["SC_1260_A2","Calamar 66",0]
["SC_1260_A2","Campestre 66",0.05]
["SC_1260_A2","Candelaria 110",0.03]
["SC_1260_A2","Carreto 66",0.01]
["SC_1260_A2","Cartagena 66",0.08]
["SC_1260_A2","Chambacu 66",0.06]
["SC_1260_A2","Cospique 66",0.02]
["SC_1260_A2","Gambote 66",0.01]
["SC_1260_A2","La Marina 66",0.08]
["SC_1260_A2","Mamonal 66",0.03]
["SC_1260_A2","Manzanillo 66",0.02]
["SC_1260_A2","Membrillal 66",0.03]
["SC_1260_A2","Nv Cospique 110",0.02]
["SC_1260_A2","Pasacaballos 110",0.03]
["SC_1260_A2","San Jacinto 66",0.03]
["SC_1260_A2","Ternera 110",0.01]
["SC_1260_A2","Ternera 66",0.08]
["SC_1260_A2","Toluviejo 110",0.01]
["SC_1260_A2","Turbaco 110",0.01]
["SC_1260_A2","Villa Estrella 66",0.02]
["SC_1260_A2","Zambrano 66",0.01]
["SC_765_A2","Argos 110",2.1999999999999999E-2]
["SC_765_A2","Nv Cospique 13.8",5.0000000000000001E-3]
["SC_765_A2","Bosque 66",12.502000000000001]
["SC_765_A2","Ternera 13.8",0]
["SC_765_A2","Bolivar 13.8",0]
["SC_765_A2","Candelaria 220",8.9999999999999993E-3]
["SC_765_A2","Bgrande 66",-0.19500000000000001]
["SC_765_A2","Campestre 66",12.694000000000001]
["SC_765_A2","Candelaria 110",2.1000000000000001E-2]
["SC_765_A2","Cartagena 66",-2.9809999999999999]
["SC_765_A2","Chambacu 66",1.48]
["SC_765_A2","Cospique 66",7.4580000000000002]
["SC_765_A2","La Marina 66",-2.0059999999999998]
["SC_765_A2","Mamonal 66",2.4430000000000001]
["SC_765_A2","Mamonal 13.8",-4.2999999999999997E-2]
["SC_765_A2","Membrillal 66",6.0030000000000001]
["SC_765_A2","Proelectrica 66",-0.73499999999999999]
["SC_765_A2","Ternera 66",0.17299999999999999]
["SC_765_A2","Ternera 220",0.371]
["SC_765_A2","Nv Cospique 110",0.38600000000000001]
["SC_765_A2","Pasacaballos 110",1.0999999999999999E-2]
["SC_765_A2","Pasacaballos 220",2E-3]
["SC_2146_A1","Bolivar 500",3.5000000000000003E-2]
["SC_2146_A1","Bolivar 220",0.20899999999999999]
["SC_2146_A1","Carreto 500",0.01]
["SC_2146_A1","Ternera 220",9.5000000000000001E-2]
["SC_2146_A1","Pasacaballos 110",1.6E-2]
["SC_2146_A1","Pasacaballos 220",1.9E-2]
["SC_2146_A1","Sabanalarga 220",0.06]
["SC_2146_A1","Sabanalarga 500",2.7E-2]
["SC_2146_A1","Ternera 110",6.0000000000000001E-3]
["SC_2146_A1","Toluviejo 220",3.0000000000000001E-3]
["SC_2146_A1","Turbaco 110",6.0000000000000001E-3]
["SC_1795_A1","Sabanalarga 220",0.17499999999999999]
["SC_1795_A1","Bolivar 220",0.38]
["SC_1795_A1","Bolivar 500",8.5999999999999993E-2]
["SC_1795_A1","Carreto 500",4.7E-2]
["SC_1795_A1","Candelaria 220",0.25900000000000001]
["SC_1795_A1","Cartagena 220",0.26100000000000001]
["SC_1795_A1","Ternera 220",0.22800000000000001]
["SC_1795_A1","Bosque 220",0.19]
["SC_1795_A1","Pasacaballos 220",0.112]
["SC_1795_A1","Toluviejo 220",4.2999999999999997E-2]
["SC_1795_A1","Pasacaballos 110",0.14899999999999999]
["SC_1795_A1","Toluviejo 110",6.0999999999999999E-2]
["SC_1795_A1","Candelaria 110",0.14099999999999999]
["SC_1795_A1","Nv Cospique 110",0.11]
["SC_1795_A1","Ternera 66",0.22900000000000001]
["SC_1795_A1","Proelectrica 66",0.19700000000000001]
["SC_1795_A1","Argos 110",0.10199999999999999]
["SC_1795_A1","Cartagena 66",0.23699999999999999]
["SC_1795_A1","Ternera 110",8.3000000000000004E-2]
["SC_1795_A1","La Marina 66",0.24099999999999999]
["SC_1795_A1","Bosque 66",0.307]
["SC_1795_A1","Bgrande 66",0.221]
["SC_1795_A1","Turbaco 110",7.0000000000000007E-2]
["SC_1795_A1","Chambacu 66",0.22]
["SC_1795_A1","Carreto 66",3.7999999999999999E-2]
["SC_1795_A1","Campestre 66",0.20499999999999999]
["SC_1795_A1","Membrillal 66",0.14000000000000001]
["SC_1795_A1","Cospique 66",0.13400000000000001]
["SC_1795_A1","Zaragocilla 66",0.112]
["SC_1795_A1","Mamonal 66",0.09]
["SC_1795_A1","El Carmen 66",1.6E-2]
["SC_1795_A1","El Carmen 110",1.0999999999999999E-2]
["SC_1795_A1","San Jacinto 66",1.4E-2]
["SC_1795_A1","Bayunca 66",0.433]
["SC_1795_A1","Calamar 66",1.0999999999999999E-2]
["SC_1795_A1","Bolivar 66",1.05]
["SC_1795_A1","Manzanillo 66",0.40300000000000002]
["SC_1795_A1","Zambrano 66",8.0000000000000002E-3]
["SC_1795_A1","Villa Estrella 66",0.35699999999999998]
["SC_1795_A1","Gambote 66",1.9E-2]
["SC_1795_A1","Sierra Flor 110",3.5999999999999997E-2]
["SC_1795_A1","Coveñas 110",2.5999999999999999E-2]
["SC_484_A1","Bolivar 13.8",0.497]
["SC_484_A1","Bosque 3 13.8",0.625]
["SC_484_A1","Bosque 5 13.8",0.63]
["SC_484_A1","Candelaria 13.8",1.43]
["SC_484_A1","El Carmen 13.8",0.252]
["SC_484_A1","Pasacaballos 1 13.8",2.4049999999999998]
["SC_484_A1","Pasacaballos 2 13.8",2.4049999999999998]
["SC_484_A1","Ternera 13.8",0.86599999999999999]
["SC_484_A1","Toluviejo 1 13.8",1.5269999999999999]
["SC_484_A1","Toluviejo 2 13.8",1.5269999999999999]
["SC_484_A1","Bolivar 34.5",0.68600000000000005]
["SC_484_A1","Bosque 66",0.82699999999999996]
["SC_484_A1","Bayunca 66",0.187]
["SC_484_A1","Bgrande 66",0.57799999999999996]
["SC_484_A1","Calamar 66",8.6999999999999994E-2]
["SC_484_A1","Campestre 66",0.65200000000000002]
["SC_484_A1","Carreto 66",0.27100000000000002]
["SC_484_A1","Cartagena 66",0.60599999999999998]
["SC_484_A1","Chambacu 66",0.58099999999999996]
["SC_484_A1","Cospique 66",0.40200000000000002]
["SC_484_A1","El Carmen 66",8.4000000000000005E-2]
["SC_484_A1","Gambote 66",0.10199999999999999]
["SC_484_A1","La Marina 66",0.62]
["SC_484_A1","Mamonal 66",0.26400000000000001]
["SC_484_A1","Membrillal 66",0.40200000000000002]
["SC_484_A1","Proelectrica 66",0.53400000000000003]
["SC_484_A1","Ternera 66",0.74399999999999999]
["SC_484_A1","Bolivar 66",0.50700000000000001]
["SC_484_A1","Manzanillo 66",0.17499999999999999]
["SC_484_A1","San Jacinto 66",9.6000000000000002E-2]
["SC_484_A1","Villa Estrella 66",0.35199999999999998]
["SC_484_A1","Zaragocilla 66",0.33500000000000002]
["SC_484_A1","Zambrano 66",5.5E-2]
["SC_484_A1","Argos 110",0.29299999999999998]
["SC_484_A1","El Carmen 110",5.7000000000000002E-2]
["SC_484_A1","Nva Toluviejo 110",0.20799999999999999]
["SC_484_A1","Nv Cospique 110",0.308]
["SC_484_A1","Pasacaballos 110",0.33600000000000002]
["SC_484_A1","Ternera 110",0.182]
["SC_484_A1","Turbaco 110",0.20399999999999999]
["SC_484_A1","Bosque 220",0.41699999999999998]
["SC_484_A1","Candelaria 220",0.54500000000000004]
["SC_484_A1","Cartagena 220",0.56399999999999995]
["SC_484_A1","Ternera 220",0.51500000000000001]
["SC_484_A1","Pasacaballos 220",0.28699999999999998]
["SC_484_A1","Sabanalarga 220",0.70399999999999996]
["SC_484_A1","Bolivar 220",0.71899999999999997]
["SC_484_A1","Toluviejo 220",0.14099999999999999]
["SC_484_A1","Carreto 500",0.246]
["SC_484_A1","Bolivar 500",0.497]
["SC_484_A1","Sierra Flor 110",0.115]
["SC_1101_A1","Bayunca 13.8",0.62]
["SC_1101_A1","Bolivar 66",0.11]
["SC_1101_A1","Bayunca 66",0.11]
["SC_1101_A1","Villa Estrella 66",0.01]
["SC_1101_A1","Manzanillo 66",0.06]
["SC_1795_A2","Sabanalarga 220",0.14799999999999999]
["SC_1795_A2","Bolivar 220",0.28899999999999998]
["SC_1795_A2","Bolivar 500",6.7000000000000004E-2]
["SC_1795_A2","Carreto 500",3.7999999999999999E-2]
["SC_1795_A2","Candelaria 220",0.32200000000000001]
["SC_1795_A2","Cartagena 220",0.30499999999999999]
["SC_1795_A2","Ternera 220",0.30399999999999999]
["SC_1795_A2","Bosque 220",0.24]
["SC_1795_A2","Pasacaballos 220",9.1999999999999998E-2]
["SC_1795_A2","Toluviejo 220",3.5999999999999997E-2]
["SC_1795_A2","Pasacaballos 110",0.14799999999999999]
["SC_1795_A2","Toluviejo 110",5.1999999999999998E-2]
["SC_1795_A2","Candelaria 110",0.159]
["SC_1795_A2","Nv Cospique 110",0.12]
["SC_1795_A2","Ternera 66",1.05]
["SC_1795_A2","Proelectrica 66",0.56399999999999995]
["SC_1795_A2","Argos 110",0.112]
["SC_1795_A2","Cartagena 66",0.60499999999999998]
["SC_1795_A2","Ternera 110",9.4E-2]
["SC_1795_A2","La Marina 66",0.53600000000000003]
["SC_1795_A2","Bosque 66",0.64600000000000002]
["SC_1795_A2","Bgrande 66",0.48699999999999999]
["SC_1795_A2","Turbaco 110",7.4999999999999997E-2]
["SC_1795_A2","Chambacu 66",0.48099999999999998]
["SC_1795_A2","Carreto 66",3.1E-2]
["SC_1795_A2","Campestre 66",0.67200000000000004]
["SC_1795_A2","Membrillal 66",0.46500000000000002]
["SC_1795_A2","Cospique 66",0.52700000000000002]
["SC_1795_A2","Zaragocilla 66",0.43]
["SC_1795_A2","Mamonal 66",0.32500000000000001]
["SC_1795_A2","El Carmen 66",1.2999999999999999E-2]
["SC_1795_A2","El Carmen 110",8.9999999999999993E-3]
["SC_1795_A2","San Jacinto 66",1.0999999999999999E-2]
["SC_1795_A2","Bayunca 66",5.0999999999999997E-2]
["SC_1795_A2","Calamar 66",8.9999999999999993E-3]
["SC_1795_A2","Bolivar 66",0.123]
["SC_1795_A2","Manzanillo 66",4.8000000000000001E-2]
["SC_1795_A2","Zambrano 66",7.0000000000000001E-3]
["SC_1795_A2","Villa Estrella 66",4.2000000000000003E-2]
["SC_1795_A2","Gambote 66",8.5999999999999993E-2]
["SC_1795_A2","Sierra Flor 110",0.03]
["SC_1795_A2","Coveñas 110",2.1999999999999999E-2]
["SC_1307_A2","Bolivar 13.8",0.21299999999999999]
["SC_1307_A2","Bosque 3 13.8",0.28399999999999997]
["SC_1307_A2","Bosque 5 13.8",0.28399999999999997]
["SC_1307_A2","Candelaria 13.8",0.745]
["SC_1307_A2","El Carmen 13.8",0.111]
["SC_1307_A2","Pasacaballos 1 13.8",3.859]
["SC_1307_A2","Pasacaballos 2 13.8",3.859]
["SC_1307_A2","Ternera 13.8",0.42499999999999999]
["SC_1307_A2","Bolivar 34.5",0.28699999999999998]
["SC_1307_A2","Bosque 66",0.38300000000000001]
["SC_1307_A2","Bayunca 66",7.9000000000000001E-2]
["SC_1307_A2","Bgrande 66",0.26300000000000001]
["SC_1307_A2","Calamar 66",2.5000000000000001E-2]
["SC_1307_A2","Campestre 66",0.28199999999999997]
["SC_1307_A2","Carreto 66",8.5000000000000006E-2]
["SC_1307_A2","Cartagena 66",0.28100000000000003]
["SC_1307_A2","Chambacu 66",0.26500000000000001]
["SC_1307_A2","Cospique 66",0.19500000000000001]
["SC_1307_A2","El Carmen 66",3.9E-2]
["SC_1307_A2","Gambote 66",4.1000000000000002E-2]
["SC_1307_A2","La Marina 66",0.28100000000000003]
["SC_1307_A2","Mamonal 66",0.13300000000000001]
["SC_1307_A2","Membrillal 66",0.19400000000000001]
["SC_1307_A2","Proelectrica 66",0.24399999999999999]
["SC_1307_A2","Ternera 66",0.34]
["SC_1307_A2","Bolivar 66",0.214]
["SC_1307_A2","Manzanillo 66",7.4999999999999997E-2]
["SC_1307_A2","San Jacinto 66",3.7999999999999999E-2]
["SC_1307_A2","Villa Estrella 66",0.16300000000000001]
["SC_1307_A2","Zaragocilla 66",0.16400000000000001]
["SC_1307_A2","Zambrano 66",2.1999999999999999E-2]
["SC_1307_A2","Argos 110",0.41399999999999998]
["SC_1307_A2","El Carmen 110",3.3000000000000002E-2]
["SC_1307_A2","Nva Toluviejo 110",0.19800000000000001]
["SC_1307_A2","Pasacaballos 110",0.9]
["SC_1307_A2","Ternera 110",0.36699999999999999]
["SC_1307_A2","Turbaco 110",0.36299999999999999]
["SC_1307_A2","Bosque 220",0.19900000000000001]
["SC_1307_A2","Candelaria 220",0.32200000000000001]
["SC_1307_A2","Cartagena 220",0.311]
["SC_1307_A2","Ternera 220",0.29399999999999998]
["SC_1307_A2","Pasacaballos 220",0.26200000000000001]
["SC_1307_A2","Bolivar 220",0.34399999999999997]
["SC_1307_A2","Toluviejo 220",0.11700000000000001]
["SC_1307_A2","Carreto 500",5.8000000000000003E-2]
["SC_1307_A2","Bolivar 500",0.10199999999999999]
["SC_1307_A2","Sierra Flor 110",0.125]
["SC_537_A2","Bolivar 220",3.17]
["SC_537_A2","Bolivar 500",0.47]
["SC_537_A2","Bosque 220",0.63]
["SC_537_A2","Carreto 500",0.09]
["SC_537_A2","Cartagena 220",1.57]
["SC_537_A2","Pasacaballos 220",0.24]
["SC_537_A2","Candelaria 220",1.4]
["SC_537_A2","Ternera 220",1.17]
["SC_537_A2","Toluviejo 220",0.01]
["SC_1123_A2","Sabanalarga 220",0.01]
["SC_1123_A2","Bolivar 220",0.02]
["SC_1123_A2","Bosque 220",0.02]
["SC_1123_A2","Candelaria 220",0.02]
["SC_1123_A2","Cartagena 220",0.02]
["SC_1123_A2","Ternera 220",0.02]
["SC_1123_A2","Bosque 66",0.06]
["SC_1123_A2","Ternera 66",0.06]
["SC_1123_A2","Zambrano 66",0.01]
["SC_1123_A2","La Marina 66",7.0000000000000007E-2]
["SC_1123_A2","Bgrande 66",0.05]
["SC_1123_A2","Cartagena 66",0.08]
["SC_1123_A2","Chambacu 66",0.05]
["SC_1123_A2","Cospique 66",0.06]
["SC_1123_A2","Mamonal 66",0.01]
["SC_1123_A2","Membrillal 66",0.13]
["SC_1123_A2","Proelectrica 66",0.1]
["SC_1123_A2","Villa Estrella 66",0.01]
["SC_1123_A2","Campestre 66",0.03]
["SC_1123_A2","Membrillal 13.8",0.02]
["SC_501_A1","Bolivar 220",0.24]
["SC_501_A1","Bolivar 500",0.38]
["SC_501_A1","Bosque 220",7.0000000000000007E-2]
["SC_501_A1","Carreto 500",0.06]
["SC_501_A1","Carreto 66",0.01]
["SC_501_A1","Pasacaballos 110",0.02]
["SC_501_A1","Pasacaballos 220",0.03]
["SC_501_A1","Sabanalarga 220",0.22]
["SC_501_A1","Sabanalarga 500",0.19]
["SC_501_A1","Candelaria 220",0.13]
["SC_501_A1","Ternera 110",0]
["SC_501_A1","Ternera 220",0.11]
["SC_501_A1","Toluviejo 220",0]
["SC_501_A1","Turbaco 110",0.01]
["SC_1003_A1","Bolivar 220",0.02]
["SC_1003_A1","Bosque 220",0.01]
["SC_1003_A1","Candelaria 220",0.02]
["SC_1003_A1","Cartagena 220",0.02]
["SC_1003_A1","Pasacaballos 220",0.01]
["SC_1003_A1","Sabanalarga 220",0.01]
["SC_1003_A1","Ternera 220",0.02]
["SC_1003_A1","Argos 110",0.01]
["SC_1003_A1","Bayunca 66",0]
["SC_1003_A1","Bgrande 66",0.01]
["SC_1003_A1","Bolivar 66",0]
["SC_1003_A1","Bosque 66",0.01]
["SC_1003_A1","Calamar 66",0]
["SC_1003_A1","Campestre 66",0]
["SC_1003_A1","Candelaria 110",0.01]
["SC_1003_A1","Carreto 66",0]
["SC_1003_A1","Cartagena 66",0.01]
["SC_1003_A1","Chambacu 66",0]
["SC_1003_A1","La Marina 66",0.01]
["SC_1003_A1","Nv Cospique 110",0.02]
["SC_1003_A1","Pasacaballos 110",0.04]
["SC_1003_A1","San Jacinto 66",0]
["SC_1003_A1","Ternera 110",0.04]
["SC_1003_A1","Ternera 66",0.01]
["SC_1003_A1","Toluviejo 110",0]
["SC_1003_A1","Turbaco 110",0.06]
["SC_1003_A1","Turbaco 13.8",0]
["SC_1428_A2","Bolivar 500",0.12]
["SC_1428_A2","Carreto 500",0.02]
["SC_1428_A2","Sabanalarga 500",0.08]
["SC_1428_A2","Bolivar 220",0.78]
["SC_1428_A2","Bosque 220",0.19]
["SC_1428_A2","Candelaria 220",0.35]
["SC_1428_A2","Cartagena 220",0.38]
["SC_1428_A2","Pasacaballos 220",0.08]
["SC_1428_A2","Sabanalarga 220",0.17]
["SC_1428_A2","Ternera 220",0.3]
["SC_1428_A2","Toluviejo 220",0.01]
["SC_1428_A2","Argos 110",0.04]
["SC_1428_A2","Bayunca 66",0.01]
["SC_1428_A2","Bgrande 66",0.13]
["SC_1428_A2","Bolivar 66",0.08]
["SC_1428_A2","Bosque 66",0.23]
["SC_1428_A2","Calamar 66",0]
["SC_1428_A2","Campestre 66",0.1]
["SC_1428_A2","Candelaria 110",0.05]
["SC_1428_A2","Carreto 66",0.02]
["SC_1428_A2","Cartagena 66",0.16]
["SC_1428_A2","Chambacu 66",0.13]
["SC_1428_A2","Cospique 66",0.04]
["SC_1428_A2","El Carmen 110",0]
["SC_1428_A2","El Carmen 66",0]
["SC_1428_A2","Gambote 66",0]
["SC_1428_A2","La Marina 66",0.17]
["SC_1428_A2","Mamonal 66",0.02]
["SC_1428_A2","Manzanillo 66",0.01]
["SC_1428_A2","Membrillal 66",0.05]
["SC_1428_A2","Nva Toluviejo 110",0.01]
["SC_1428_A2","Nv Cospique 110",0.04]
["SC_1428_A2","Pasacaballos 110",0.05]
["SC_1428_A2","San Jacinto 66",0]
["SC_1428_A2","Ternera 110",0.02]
["SC_1428_A2","Ternera 66",0.15]
["SC_1428_A2","Toluviejo 110",0.01]
["SC_1428_A2","Turbaco 110",0.02]
["SC_1428_A2","Villa Estrella 66",0.03]
["SC_1428_A2","Zambrano 66",0]
["SC_2179_A1","Bolivar 500",0.24]
["SC_2179_A1","Carreto 500",0.09]
["SC_2179_A1","Sabanalarga 500",0.17]
["SC_2179_A1","Bolivar 220",0.62]
["SC_2179_A1","Pasacaballos 220",0.25]
["SC_2179_A1","Sabanalarga 220",0.38]
["SC_2179_A1","Toluviejo 220",0.08]
["SC_2179_A1","Argos 110",0.26]
["SC_2179_A1","Candelaria 110",0.42]
["SC_2179_A1","El Carmen 110",0.02]
["SC_2179_A1","Nva Toluviejo 110",0.12]
["SC_2179_A1","Pasacaballos 110",0.3]
["SC_2179_A1","Ternera 110",0.21]
["SC_2179_A1","Turbaco 110",0.18]
["SC_2179_A1","Bayunca 66",0.16]
["SC_2179_A1","Bgrande 66",0.42]
["SC_2179_A1","Bolivar 66",1.34]
["SC_2179_A1","Bosque 66",0.7]
["SC_2179_A1","Calamar 66",0.03]
["SC_2179_A1","Campestre 66",0.5]
["SC_2179_A1","Carreto 66",0.21]
["SC_2179_A1","Cartagena 66",0.5]
["SC_2179_A1","Chambacu 66",0.43]
["SC_2179_A1","Cospique 66",0.32]
["SC_2179_A1","El Carmen 66",0.04]
["SC_2179_A1","Gambote 66",0.06]
["SC_2179_A1","La Marina 66",0.47]
["SC_2179_A1","Mamonal 66",0.21]
["SC_2179_A1","Membrillal 66",0.33]
["SC_2179_A1","Proelectrica 66",0.44]
["SC_2179_A1","San Jacinto 66",0.04]
["SC_2179_A1","Villa Estrella 66",0.28999999999999998]
["SC_2179_A1","Zambrano 66",0.02]
["SC_2179_A1","Zaragocilla 66",0.27]
["SC_2179_A1","Coveñas 110",0.03]
["SC_1290_A1","Bolivar 500",0.01]
["SC_1290_A1","Bosque 220",0]
["SC_1290_A1","Bolivar 220",0.04]
["SC_1290_A1","Candelaria 220",0]
["SC_1290_A1","Cartagena 220",0.02]
["SC_1290_A1","Pasacaballos 220",0.01]
["SC_1290_A1","Toluviejo 220",0]
["SC_1290_A1","Argos 110",0]
["SC_1290_A1","Nva Toluviejo 110",0]
["SC_1290_A1","Pasacaballos 110",0]
["SC_1290_A1","Ternera 110",0]
["SC_1290_A1","Turbaco 110",0]
["SC_1290_A1","Bosque 66",0]
["SC_1290_A1","Bayunca 66",0.08]
["SC_1290_A1","Bolivar 66",0.13]
["SC_1290_A1","Campestre 66",0]
["SC_1290_A1","Cartagena 66",-0.01]
["SC_1290_A1","Manzanillo 66",0.12]
["SC_1290_A1","Villa Estrella 66",0]
["SC_1290_A1","Manzanillo 13.8",0.06]
["SC_2034_A1","Bolivar 500",0.95]
["SC_2034_A1","Bolivar 220",3.8]
["SC_2034_A1","Cartagena 220",2.77]
["SC_2034_A1","Pasacaballos 220",1.29]
["SC_2034_A1","Toluviejo 220",0.56999999999999995]
["SC_2034_A1","Argos 110",1.19]
["SC_2034_A1","Nva Toluviejo 110",0.95]
["SC_2034_A1","Pasacaballos 110",1.75]
["SC_2034_A1","Ternera 110",1.04]
["SC_2034_A1","Turbaco 110",0.86]
["SC_2034_A1","Bayunca 66",8.67]
["SC_2034_A1","Bolivar 66",10.52]
["SC_2034_A1","Campestre 66",2.39]
["SC_2034_A1","Cartagena 66",2.4300000000000002]
["SC_2034_A1","Manzanillo 66",10.51]
["SC_2034_A1","Villa Estrella 66",3.56]
["SC_2034_A1","Manzanillo 13.8",31.96]
["SC_1209_A1","Bolivar 500",0.09]
["SC_1209_A1","Carreto 500",0.01]
["SC_1209_A1","Sabanalarga 500",0.06]
["SC_1209_A1","Bolivar 220",0.59]
["SC_1209_A1","Bosque 220",0.14000000000000001]
["SC_1209_A1","Candelaria 220",0.25]
["SC_1209_A1","Cartagena 220",0.28000000000000003]
["SC_1209_A1","Pasacaballos 220",0.06]
["SC_1209_A1","Sabanalarga 220",0.12]
["SC_1209_A1","Ternera 220",0.22]
["SC_1209_A1","Toluviejo 220",0.01]
["SC_1209_A1","Argos 110",0.03]
["SC_1209_A1","Bayunca 66",0.01]
["SC_1209_A1","Bgrande 66",0.09]
["SC_1209_A1","Bolivar 66",0.06]
["SC_1209_A1","Bosque 66",0.17]
["SC_1209_A1","Campestre 66",7.0000000000000007E-2]
["SC_1209_A1","Candelaria 110",0.04]
["SC_1209_A1","Carreto 66",0.01]
["SC_1209_A1","Cartagena 66",0.12]
["SC_1209_A1","Chambacu 66",0.09]
["SC_1209_A1","Cospique 66",0.03]
["SC_1209_A1","La Marina 66",0.12]
["SC_1209_A1","Mamonal 66",0.01]
["SC_1209_A1","Manzanillo 66",0.01]
["SC_1209_A1","Membrillal 66",0.04]
["SC_1209_A1","Nv Cospique 110",0.03]
["SC_1209_A1","Pasacaballos 110",0.04]
["SC_1209_A1","Ternera 110",0.01]
["SC_1209_A1","Ternera 66",0.11]
["SC_1209_A1","Turbaco 110",0.01]
["SC_1209_A1","Villa Estrella 66",0.02]
["SC_1209_A1","Zambrano 66",0.02]
["SC_1196_A2","Bolivar 500",0.12]
["SC_1196_A2","Carreto 500",0.02]
["SC_1196_A2","Sabanalarga 500",0.08]
["SC_1196_A2","Bolivar 220",0.78]
["SC_1196_A2","Bosque 220",0.19]
["SC_1196_A2","Candelaria 220",0.35]
["SC_1196_A2","Cartagena 220",0.38]
["SC_1196_A2","Pasacaballos 220",0.08]
["SC_1196_A2","Sabanalarga 220",0.17]
["SC_1196_A2","Ternera 220",0.3]
["SC_1196_A2","Toluviejo 220",0.01]
["SC_1196_A2","Argos 110",0.04]
["SC_1196_A2","Bayunca 66",0.01]
["SC_1196_A2","Bgrande 66",0.13]
["SC_1196_A2","Bolivar 66",0.08]
["SC_1196_A2","Bosque 66",0.23]
["SC_1196_A2","Campestre 66",0.1]
["SC_1196_A2","Candelaria 110",0.05]
["SC_1196_A2","Carreto 66",0.02]
["SC_1196_A2","Cartagena 66",0.16]
["SC_1196_A2","Chambacu 66",0.13]
["SC_1196_A2","Cospique 66",0.04]
["SC_1196_A2","La Marina 66",0.17]
["SC_1196_A2","Mamonal 66",0.02]
["SC_1196_A2","Manzanillo 66",0.01]
["SC_1196_A2","Membrillal 66",0.05]
["SC_1196_A2","Nva Toluviejo 110",0.01]
["SC_1196_A2","Nv Cospique 110",0.04]
["SC_1196_A2","Pasacaballos 110",0.05]
["SC_1196_A2","Ternera 110",0.02]
["SC_1196_A2","Ternera 66",0.15]
["SC_1196_A2","Toluviejo 110",0.01]
["SC_1196_A2","Turbaco 110",0.02]
["SC_1196_A2","Villa Estrella 66",0.03]
["SC_1196_A2","Zambrano 66",0.03]
["SC_545_A2","Carreto 66",0.04]
["SC_545_A2","El Carmen 110",0.01]
["SC_545_A2","El Carmen 66",0.04]
["SC_545_A2","San Jacinto 66",0.08]
["SC_545_A2","Zambrano 66",0.02]
["SC_545_A2","El Carmen 13.8",7.0000000000000007E-2]
["SC_545_A2","San Jacinto 13.8",0.19]
["SC_545_A2","San Jacinto 34.5",0.16]
["SC_545_A2","San Juan Nepomuceno 13.8",0.11]
["SC_545_A2","San Juan Nepomuceno 34.5",0.17]
["SC_1607_A1","Bolivar 500",0.44]
["SC_1607_A1","Carreto 500",0.04]
["SC_1607_A1","Sabanalarga 500",0.16]
["SC_1607_A1","Bolivar 220",0.22]
["SC_1607_A1","Cartagena 220",0.11]
["SC_1607_A1","Candelaria 220",0.1]
["SC_1607_A1","Pasacaballos 220",0.02]
["SC_1607_A1","Sabanalarga 220",0.17]
["SC_1607_A1","Toluviejo 220",0]
["SC_831_A1","Argos 110",0]
["SC_831_A1","Bayunca 66",0]
["SC_831_A1","Bgrande 66",0]
["SC_831_A1","Bolivar 220",0]
["SC_831_A1","Bolivar 500",0]
["SC_831_A1","Bolivar 66",0]
["SC_831_A1","Bosque 220",0]
["SC_831_A1","Bosque 66",0]
["SC_831_A1","Calamar 66",0]
["SC_831_A1","Campestre 66",0]
["SC_831_A1","Carreto 500",0]
["SC_831_A1","Carreto 66",0]
["SC_831_A1","Cartagena 66",0]
["SC_831_A1","Chambacu 66",0]
["SC_831_A1","Cospique 66",0]
["SC_831_A1","El Carmen 110",0]
["SC_831_A1","El Carmen 66",0]
["SC_831_A1","Gambote 66",0]
["SC_831_A1","La Marina 66",0]
["SC_831_A1","Mamonal 66",0]
["SC_831_A1","Manzanillo 66",0]
["SC_831_A1","Membrillal 66",0]
["SC_831_A1","Nv Cospique 110",0]
["SC_831_A1","Nva Toluviejo 110",0]
["SC_831_A1","Pasacaballos 110",0]
["SC_831_A1","Pasacaballos 220",0]
["SC_831_A1","Proelectrica 66",0]
["SC_831_A1","San Jacinto 66",0]
["SC_831_A1","Cartagena 220",0]
["SC_831_A1","Candelaria 110",0]
["SC_831_A1","Candelaria 220",0]
["SC_831_A1","Ternera 110",0]
["SC_831_A1","Ternera 220",0]
["SC_831_A1","Ternera 66",0]
["SC_831_A1","Toluviejo 110",0]
["SC_831_A1","Turbaco 110",0]
["SC_831_A1","Villa Estrella 66",0]
["SC_831_A1","Zambrano 34.5",0]
["SC_831_A1","Zambrano 66",0]
["SC_831_A1","Zaragocilla 66",0]
["SC_1741_A1","Bosque 66",0.06]
["SC_1741_A1","Ternera 66",0.05]
["SC_1741_A1","Carreto 66",0.12]
["SC_1741_A1","Cartagena 66",0.13]
["SC_1741_A1","Campestre 66",0.1]
["SC_1741_A1","Cartagena 220",0.1]
["SC_1741_A1","Candelaria 220",0.09]
["SC_1741_A1","La Marina 66",0.03]
["SC_1741_A1","Ternera 220",0.3]
["SC_1741_A1","Chambacu 66",0.02]
["SC_1741_A1","Bgrande 66",0.02]
["SC_1741_A1","Bolivar 66",0.02]
["SC_1741_A1","Membrillal 66",0.02]
["SC_1741_A1","Cospique 66",0.01]
["SC_1741_A1","Bosque 220",0.2]
["SC_1741_A1","Sabanalarga 500",0.48]
["SC_1741_A1","Pasacaballos 110",0.06]
["SC_1741_A1","Zaragocilla 66",0.01]
["SC_1741_A1","Villa Estrella 66",0.01]
["SC_1741_A1","Toluviejo 220",0.01]
["SC_1741_A1","Nv Cospique 110",0.04]
["SC_1741_A1","Bolivar 500",0.22]
["SC_1741_A1","Argos 110",0.06]
["SC_1741_A1","Mamonal 66",0.01]
["SC_1741_A1","Pasacaballos 220",0.05]
["SC_1741_A1","Carreto 500",0.12]
["SC_1741_A1","Turbaco 110",0.02]
["SC_1741_A1","Ternera 110",0.67]
["SC_436_A1","Bolivar 220",0.16]
["SC_436_A1","Bolivar 500",0.25]
["SC_436_A1","Bosque 220",0.04]
["SC_436_A1","Carreto 500",0.03]
["SC_436_A1","Pasacaballos 110",0.01]
["SC_436_A1","Pasacaballos 220",0.01]
["SC_436_A1","Sabanalarga 220",0.12]
["SC_436_A1","Sabanalarga 500",0.12]
["SC_436_A1","Candelaria 220",0.08]
["SC_436_A1","Cartagena 220",0.08]
["SC_436_A1","Ternera 110",0]
["SC_436_A1","Ternera 220",7.0000000000000007E-2]
["SC_436_A1","Toluviejo 220",0]
["SC_436_A1","Turbaco 110",0.01]
["SC_2201_A1","Bolivar 500",0.03]
["SC_2201_A1","Carreto 500",0]
["SC_2201_A1","Sabanalarga 500",0.03]
["SC_2201_A1","Bosque 220",0.03]
["SC_2201_A1","Bolivar 220",0.23]
["SC_2201_A1","Ternera 220",0.08]
["SC_2201_A1","Pasacaballos 220",0.33]
["SC_2201_A1","Sabanalarga 220",0.04]
["SC_2201_A1","Toluviejo 220",0]
["SC_2201_A1","Nva Toluviejo 110",-0.03]
["SC_2201_A1","Pasacaballos 110",0.04]
["SC_2201_A1","Ternera 110",-0.03]
["SC_2201_A1","Turbaco 110",-0.03]
["SC_2201_A1","Carreto 66",-0.02]
["SC_545_A1","Carreto 66",0.03]
["SC_545_A1","El Carmen 110",0.01]
["SC_545_A1","El Carmen 66",0.03]
["SC_545_A1","San Jacinto 66",7.0000000000000007E-2]
["SC_545_A1","Zambrano 66",0.02]
["SC_545_A1","El Carmen 13.8",0.06]
["SC_545_A1","San Jacinto 13.8",0.16]
["SC_545_A1","San Jacinto 34.5",0.14000000000000001]
["SC_545_A1","San Juan Nepomuceno 13.8",0.41]
["SC_545_A1","San Juan Nepomuceno 34.5",0.14000000000000001]
["SC_1123_A1","Bolivar 220",0.02]
["SC_1123_A1","Bosque 220",0.01]
["SC_1123_A1","Candelaria 220",0.02]
["SC_1123_A1","Cartagena 220",0.02]
["SC_1123_A1","Ternera 220",0.02]
["SC_1123_A1","Bosque 66",0.05]
["SC_1123_A1","Ternera 66",0.05]
["SC_1123_A1","Zambrano 66",0.01]
["SC_1123_A1","La Marina 66",0.06]
["SC_1123_A1","Bgrande 66",0.04]
["SC_1123_A1","Cartagena 66",7.0000000000000007E-2]
["SC_1123_A1","Chambacu 66",0.04]
["SC_1123_A1","Cospique 66",0.05]
["SC_1123_A1","Mamonal 66",0.01]
["SC_1123_A1","Membrillal 66",0.11]
["SC_1123_A1","Proelectrica 66",0.08]
["SC_1123_A1","Villa Estrella 66",0.01]
["SC_1123_A1","Campestre 66",0.03]
["SC_1123_A1","Membrillal 13.8",0.56000000000000005]
["SC_1963_A2","Argos 110",0.12]
["SC_1963_A2","Bayunca 66",0.05]
["SC_1963_A2","Bgrande 66",0.25]
["SC_1963_A2","Bolivar 220",0.85]
["SC_1963_A2","Bolivar 500",0.14000000000000001]
["SC_1963_A2","Bolivar 66",0.12]
["SC_1963_A2","Bosque 220",0.21]
["SC_1963_A2","Bosque 66",0.35]
["SC_1963_A2","Calamar 66",0.01]
["SC_1963_A2","Campestre 66",0.25]
["SC_1963_A2","Candelaria 110",0.14000000000000001]
["SC_1963_A2","Candelaria 220",0.31]
["SC_1963_A2","Carreto 500",0.05]
["SC_1963_A2","Carreto 66",0.04]
["SC_1963_A2","Cartagena 220",0.28999999999999998]
["SC_1963_A2","Cartagena 66",0.28999999999999998]
["SC_1963_A2","Chambacu 66",0.25]
["SC_1963_A2","Cospique 66",0.17]
["SC_1963_A2","El Carmen 110",0.01]
["SC_1963_A2","El Carmen 66",0.02]
["SC_1963_A2","Gambote 66",0.02]
["SC_1963_A2","La Marina 66",0.28000000000000003]
["SC_1963_A2","Mamonal 66",0.12]
["SC_1963_A2","Manzanillo 66",0.05]
["SC_1963_A2","Membrillal 66",0.18]
["SC_1963_A2","Nv Cospique 110",0.13]
["SC_1963_A2","Pasacaballos 110",0.15]
["SC_1963_A2","Pasacaballos 220",0.12]
["SC_1963_A2","Proelectrica 66",0.24]
["SC_1963_A2","Sabanalarga 220",0.18]
["SC_1963_A2","San Jacinto 66",0.01]
["SC_1963_A2","Ternera 110",0.08]
["SC_1963_A2","Ternera 220",0.32]
["SC_1963_A2","Ternera 66",0.3]
["SC_1963_A2","Toluviejo 110",0.06]
["SC_1963_A2","Toluviejo 220",0.04]
["SC_1963_A2","Turbaco 110",0.08]
["SC_1963_A2","Villa Estrella 66",0.04]
["SC_1963_A2","Zambrano 66",0.01]
["SC_1963_A2","Zaragocilla 66",0.14000000000000001]
["SC_1963_A2","Sierra Flor 110",0.03]
["SC_1963_A2","Coveñas 110",0.03]
["SC_970_A1","Bolivar 220",0.02]
["SC_970_A1","Bosque 220",0.02]
["SC_970_A1","Candelaria 220",0.02]
["SC_970_A1","Cartagena 220",0.02]
["SC_970_A1","Pasacaballos 220",0]
["SC_970_A1","Sabanalarga 220",0.01]
["SC_970_A1","Ternera 220",0.02]
["SC_970_A1","Bayunca 66",0]
["SC_970_A1","Bgrande 66",0.03]
["SC_970_A1","Bolivar 66",0.01]
["SC_970_A1","Bosque 66",0.05]
["SC_970_A1","Calamar 66",0]
["SC_970_A1","Campestre 66",0.05]
["SC_970_A1","Cartagena 66",0.05]
["SC_970_A1","Chambacu 66",0.03]
["SC_970_A1","Cospique 66",0.03]
["SC_970_A1","La Marina 66",0.04]
["SC_970_A1","Mamonal 66",0.01]
["SC_970_A1","Manzanillo 66",0]
["SC_970_A1","Membrillal 66",0.02]
["SC_970_A1","Ternera 66",0.14000000000000001]
["SC_970_A1","Villa Estrella 66",0.02]
["SC_970_A1","Zambrano 66",0.02]
["SC_1525_A1","Bolivar 500",0.02]
["SC_1525_A1","Sabanalarga 500",0.02]
["SC_1525_A1","Bosque 220",0.01]
["SC_1525_A1","Bolivar 220",0.12]
["SC_1525_A1","Ternera 220",0.04]
["SC_1525_A1","Pasacaballos 220",0.17]
["SC_1525_A1","Sabanalarga 220",0.02]
["SC_1525_A1","Nva Toluviejo 110",-0.02]
["SC_1525_A1","Pasacaballos 110",0.02]
["SC_1525_A1","Ternera 110",-0.01]
["SC_1525_A1","Turbaco 110",-0.02]
["SC_1525_A1","Carreto 66",-0.01]
["SC_960_A2","Calamar 34.5",0.09]
["SC_960_A2","Calamar 66",0.02]
["SC_960_A2","El Carmen 110",0]
["SC_960_A2","Toluviejo 110",0.02]
["SC_960_A2","Toluviejo 220",0]
["SC_960_A2","Sierra Flor 110",0.01]
["SC_631_A2","Carreto 500",0.01]
["SC_631_A2","Cartagena 220",0.01]
["SC_631_A2","Candelaria 220",0.01]
["SC_631_A2","Bolivar 220",0.01]
["SC_631_A2","Sabanalarga 220",0.01]
["SC_631_A2","Sabanalarga 500",0.01]
["SC_631_A2","Bolivar 500",0.01]
["SC_631_A2","Ternera 220",0.01]
["SC_631_A2","Toluviejo 110",0.11]
["SC_631_A2","Pasacaballos 220",0.01]
["SC_631_A2","Pasacaballos 110",0.01]
["SC_631_A2","Toluviejo 220",0.03]
["SC_631_A2","Zambrano 66",0.04]
["SC_631_A2","El Carmen 66",0.19]
["SC_631_A2","El Carmen 13.8",0.41]
["SC_631_A2","El Carmen 110",0.26]
["SC_631_A2","San Jacinto 66",0.1]
["SC_631_A2","Carreto 66",0.06]
["SC_484_A2","Bolivar 13.8",0.77600000000000002]
["SC_484_A2","Bosque 3 13.8",0.96899999999999997]
["SC_484_A2","Bosque 5 13.8",0.97699999999999998]
["SC_484_A2","Candelaria 13.8",2.1840000000000002]
["SC_484_A2","El Carmen 13.8",0.24399999999999999]
["SC_484_A2","Pasacaballos 1 13.8",3.5939999999999999]
["SC_484_A2","Pasacaballos 2 13.8",3.5939999999999999]
["SC_484_A2","Ternera 13.8",1.3149999999999999]
["SC_484_A2","Toluviejo 1 13.8",1.7729999999999999]
["SC_484_A2","Toluviejo 2 13.8",1.7729999999999999]
["SC_484_A2","Bolivar 34.5",1.105]
["SC_484_A2","Bosque 66",1.2749999999999999]
["SC_484_A2","Bayunca 66",0.29199999999999998]
["SC_484_A2","Bgrande 66",0.89]
["SC_484_A2","Calamar 66",7.4999999999999997E-2]
["SC_484_A2","Campestre 66",0.998]
["SC_484_A2","Carreto 66",0.23499999999999999]
["SC_484_A2","Cartagena 66",0.92800000000000005]
["SC_484_A2","Chambacu 66",0.89500000000000002]
["SC_484_A2","Cospique 66",0.61299999999999999]
["SC_484_A2","El Carmen 66",8.2000000000000003E-2]
["SC_484_A2","Gambote 66",0.123]
["SC_484_A2","La Marina 66",0.95399999999999996]
["SC_484_A2","Mamonal 66",0.40300000000000002]
["SC_484_A2","Membrillal 66",0.61299999999999999]
["SC_484_A2","Proelectrica 66",0.81699999999999995]
["SC_484_A2","Ternera 66",1.1299999999999999]
["SC_484_A2","Bolivar 66",0.79200000000000004]
["SC_484_A2","Manzanillo 66",0.27300000000000002]
["SC_484_A2","San Jacinto 66",0.09]
["SC_484_A2","Villa Estrella 66",0.54]
["SC_484_A2","Zaragocilla 66",0.51100000000000001]
["SC_484_A2","Zambrano 66",5.1999999999999998E-2]
["SC_484_A2","Argos 110",0.44]
["SC_484_A2","El Carmen 110",6.0999999999999999E-2]
["SC_484_A2","Nva Toluviejo 110",0.24199999999999999]
["SC_484_A2","Nv Cospique 110",0.46200000000000002]
["SC_484_A2","Pasacaballos 110",0.499]
["SC_484_A2","Ternera 110",0.26600000000000001]
["SC_484_A2","Turbaco 110",0.3]
["SC_484_A2","Bosque 220",0.64600000000000002]
["SC_484_A2","Candelaria 220",0.83299999999999996]
["SC_484_A2","Cartagena 220",0.86499999999999999]
["SC_484_A2","Ternera 220",0.78200000000000003]
["SC_484_A2","Pasacaballos 220",0.433]
["SC_484_A2","Sabanalarga 220",0.65900000000000003]
["SC_484_A2","Bolivar 220",1.129]
["SC_484_A2","Toluviejo 220",0.16400000000000001]
["SC_484_A2","Carreto 500",0.189]
["SC_484_A2","Bolivar 500",0.32600000000000001]
["SC_484_A2","Sierra Flor 110",0.10199999999999999]
["SC_2068_A1","Argos 110",0]
["SC_2068_A1","Bosque 220",0]
["SC_2068_A1","Bosque 66",0]
["SC_2068_A1","Bolivar 500",0]
["SC_2068_A1","Candelaria 220",0]
["SC_2068_A1","Bolivar 66",0]
["SC_2068_A1","Cartagena 220",0]
["SC_2068_A1","Bayunca 66",0]
["SC_2068_A1","Bgrande 66",0]
["SC_2068_A1","Calamar 34.5",0]
["SC_2068_A1","Calamar 66",0]
["SC_2068_A1","Campestre 66",0]
["SC_2068_A1","Candelaria 13.8",0]
["SC_2068_A1","Carreto 500",0]
["SC_2068_A1","Carreto 66",0]
["SC_2068_A1","Cartagena 66",0]
["SC_2068_A1","Chambacu 66",0]
["SC_2068_A1","Cospique 66",0]
["SC_2068_A1","El Carmen 110",0]
["SC_2068_A1","El Carmen 66",0]
["SC_2068_A1","Gambote 66",0]
["SC_2068_A1","La Marina 66",0]
["SC_2068_A1","Mamonal 66",0]
["SC_2068_A1","Membrillal 66",0]
["SC_2068_A1","Nva Toluviejo 110",0]
["SC_2068_A1","Pasacaballos 110",0]
["SC_2068_A1","Pasacaballos 220",0]
["SC_2068_A1","Sabanalarga 220",0]
["SC_2068_A1","Sabanalarga 500",0]
["SC_2068_A1","San Jacinto 66",0]
["SC_2068_A1","Ternera 110",0]
["SC_2068_A1","Toluviejo 220",0]
["SC_2068_A1","Turbaco 110",0]
["SC_2068_A1","Villa Estrella 66",0]
["SC_2068_A1","Zaragocilla 66",0]
["SC_2068_A1","Zambrano 66",0]
["SC_1976_A2","Argos 110",0.12]
["SC_1976_A2","Bayunca 66",0.05]
["SC_1976_A2","Bgrande 66",0.26]
["SC_1976_A2","Bolivar 220",0.3]
["SC_1976_A2","Bolivar 500",7.0000000000000007E-2]
["SC_1976_A2","Bolivar 66",0.12]
["SC_1976_A2","Bosque 220",0.21]
["SC_1976_A2","Bosque 66",0.34]
["SC_1976_A2","Calamar 66",0.01]
["SC_1976_A2","Campestre 66",0.25]
["SC_1976_A2","Candelaria 110",0.19]
["SC_1976_A2","Candelaria 220",0.72]
["SC_1976_A2","Carreto 500",0.04]
["SC_1976_A2","Carreto 66",0.03]
["SC_1976_A2","Cartagena 220",0.54]
["SC_1976_A2","Cartagena 66",0.28999999999999998]
["SC_1976_A2","Chambacu 66",0.26]
["SC_1976_A2","Cospique 66",0.18]
["SC_1976_A2","El Carmen 110",0.01]
["SC_1976_A2","El Carmen 66",0.01]
["SC_1976_A2","Gambote 66",0.03]
["SC_1976_A2","La Marina 66",0.28000000000000003]
["SC_1976_A2","Mamonal 66",0.11]
["SC_1976_A2","Manzanillo 66",0.04]
["SC_1976_A2","Membrillal 66",0.18]
["SC_1976_A2","Nv Cospique 110",0.14000000000000001]
["SC_1976_A2","Pasacaballos 110",0.16]
["SC_1976_A2","Pasacaballos 220",0.09]
["SC_1976_A2","Proelectrica 66",0.24]
["SC_1976_A2","Sabanalarga 220",0.16]
["SC_1976_A2","San Jacinto 66",0.01]
["SC_1976_A2","Ternera 110",0.11]
["SC_1976_A2","Ternera 220",1.05]
["SC_1976_A2","Ternera 66",0.3]
["SC_1976_A2","Toluviejo 110",0.06]
["SC_1976_A2","Toluviejo 220",0.03]
["SC_1976_A2","Turbaco 110",0.08]
["SC_1976_A2","Villa Estrella 66",0.04]
["SC_1976_A2","Zambrano 66",0.01]
["SC_1976_A2","Zaragocilla 66",0.14000000000000001]
["SC_1976_A2","Sierra Flor 110",0.03]
["SC_1976_A2","Coveñas 110",0.02]
["SC_1975_A2","Argos 110",0.12]
["SC_1975_A2","Bayunca 66",0.05]
["SC_1975_A2","Bgrande 66",0.26]
["SC_1975_A2","Bolivar 220",0.3]
["SC_1975_A2","Bolivar 500",7.0000000000000007E-2]
["SC_1975_A2","Bolivar 66",0.12]
["SC_1975_A2","Bosque 220",0.21]
["SC_1975_A2","Bosque 66",0.34]
["SC_1975_A2","Calamar 66",0.01]
["SC_1975_A2","Campestre 66",0.25]
["SC_1975_A2","Candelaria 110",0.19]
["SC_1975_A2","Candelaria 220",0.72]
["SC_1975_A2","Carreto 500",0.04]
["SC_1975_A2","Carreto 66",0.03]
["SC_1975_A2","Cartagena 220",0.54]
["SC_1975_A2","Cartagena 66",0.28999999999999998]
["SC_1975_A2","Chambacu 66",0.26]
["SC_1975_A2","Cospique 66",0.18]
["SC_1975_A2","El Carmen 110",0.01]
["SC_1975_A2","El Carmen 66",0.01]
["SC_1975_A2","Gambote 66",0.03]
["SC_1975_A2","La Marina 66",0.28000000000000003]
["SC_1975_A2","Mamonal 66",0.11]
["SC_1975_A2","Manzanillo 66",0.04]
["SC_1975_A2","Membrillal 66",0.18]
["SC_1975_A2","Nv Cospique 110",0.14000000000000001]
["SC_1975_A2","Pasacaballos 110",0.16]
["SC_1975_A2","Pasacaballos 220",0.09]
["SC_1975_A2","Proelectrica 66",0.24]
["SC_1975_A2","Sabanalarga 220",0.16]
["SC_1975_A2","San Jacinto 66",0.01]
["SC_1975_A2","Ternera 110",0.11]
["SC_1975_A2","Ternera 220",1.05]
["SC_1975_A2","Ternera 66",0.3]
["SC_1975_A2","Toluviejo 110",0.06]
["SC_1975_A2","Toluviejo 220",0.03]
["SC_1975_A2","Turbaco 110",0.08]
["SC_1975_A2","Villa Estrella 66",0.04]
["SC_1975_A2","Zambrano 66",0.01]
["SC_1975_A2","Zaragocilla 66",0.14000000000000001]
["SC_1975_A2","Sierra Flor 110",0.03]
["SC_1975_A2","Coveñas 110",0.02]
["SC_1705_A2","Bolivar 13.8",0.03]
["SC_1705_A2","Bosque 3 13.8",0.04]
["SC_1705_A2","Bosque 5 13.8",0.04]
["SC_1705_A2","Candelaria 13.8",0.09]
["SC_1705_A2","El Carmen 13.8",0.01]
["SC_1705_A2","Mamonal 13.8",0.62]
["SC_1705_A2","Pasacaballos 1 13.8",0.11]
["SC_1705_A2","Pasacaballos 2 13.8",0.11]
["SC_1705_A2","Pasacaballos 13.8",0.02]
["SC_1705_A2","Ternera 13.8",0.13]
["SC_1705_A2","Bolivar 34.5",0.03]
["SC_1705_A2","Bayunca 66",0.01]
["SC_1705_A2","Bgrande 66",0.06]
["SC_1705_A2","Bolivar 66",0.03]
["SC_1705_A2","Bosque 66",7.0000000000000007E-2]
["SC_1705_A2","Calamar 66",0]
["SC_1705_A2","Campestre 66",7.0000000000000007E-2]
["SC_1705_A2","Carreto 66",0.01]
["SC_1705_A2","Cartagena 66",0.09]
["SC_1705_A2","Chambacu 66",0.05]
["SC_1705_A2","Cospique 66",0.06]
["SC_1705_A2","La Marina 66",0.05]
["SC_1705_A2","Mamonal 66",0.13]
["SC_1705_A2","Manzanillo 66",0.01]
["SC_1705_A2","Membrillal 66",7.0000000000000007E-2]
["SC_1705_A2","Proelectrica 66",0.11]
["SC_1705_A2","San Jacinto 66",0.01]
["SC_1705_A2","Ternera 66",0.1]
["SC_1705_A2","Villa Estrella 66",0.04]
["SC_1705_A2","Zambrano 66",0.01]
["SC_1705_A2","Zaragocilla 66",0.05]
["SC_1705_A2","Argos 110",0.02]
["SC_1705_A2","El Carmen 110",0.01]
["SC_1705_A2","Nv Cospique 110",0.02]
["SC_1705_A2","Nva Toluviejo 110",0]
["SC_1705_A2","Pasacaballos 110",0.02]
["SC_1705_A2","Ternera 110",0.02]
["SC_1705_A2","Turbaco 110",0.02]
["SC_1705_A2","Bolivar 220",0.04]
["SC_1705_A2","Bosque 220",0.03]
["SC_1705_A2","Candelaria 220",0.04]
["SC_1705_A2","Cartagena 220",0.03]
["SC_1705_A2","Pasacaballos 220",0.02]
["SC_1705_A2","Sabanalarga 220",0.02]
["SC_1705_A2","Ternera 220",0.04]
["SC_1705_A2","Toluviejo 220",0.01]
["SC_1705_A2","Bolivar 500",0.01]
["SC_1705_A2","Carreto 500",0.01]
["SC_1705_A2","Sierra Flor 110",0.01]
["SC_1915_A2","Carreto 500",0]
["SC_1915_A2","Carreto 66",0.4]
["SC_1915_A2","Calamar 66",0]
["SC_1915_A2","San Jacinto 66",0]
["SC_1915_A2","El Carmen 66",0.1]
["SC_1915_A2","Gambote 66",0]
["SC_2201_A2","Bolivar 500",0.02]
["SC_2201_A2","Carreto 500",0]
["SC_2201_A2","Sabanalarga 500",0.02]
["SC_2201_A2","Bosque 220",0.03]
["SC_2201_A2","Bolivar 220",0.18]
["SC_2201_A2","Ternera 220",0.12]
["SC_2201_A2","Pasacaballos 220",0.11]
["SC_2201_A2","Sabanalarga 220",0.04]
["SC_2201_A2","Toluviejo 220",0]
["SC_2201_A2","Nva Toluviejo 110",-0.02]
["SC_2201_A2","Pasacaballos 110",0.64]
["SC_2201_A2","Ternera 110",0.01]
["SC_2201_A2","Turbaco 110",0.08]
["SC_2201_A2","Carreto 66",-0.02]
["SC_784_A1","Bayunca 13.8",0.22]
["SC_784_A1","Bayunca 66",0.04]
["SC_784_A1","Bolivar 220",-0.01]
["SC_784_A1","Bolivar 500",0]
["SC_784_A1","Bolivar 66",0.05]
["SC_784_A1","Carreto 500",0]
["SC_784_A1","Carreto 66",0]
["SC_784_A1","Gambote 66",0]
["SC_784_A1","Manzanillo 66",0.03]
["SC_784_A1","Pasacaballos 110",0]
["SC_784_A1","Ternera 66",0]
["SC_784_A1","Sabanalarga 220",0]
["SC_784_A1","Ternera 110",0]
["SC_784_A1","Turbaco 110",0]
["SC_784_A1","Villa Estrella 66",0]
["SC_2099_A2","Bolivar 13.8",0.14000000000000001]
["SC_2099_A2","Bosque 3 13.8",0.08]
["SC_2099_A2","Bosque 5 13.8",7.0000000000000007E-2]
["SC_2099_A2","Candelaria 13.8",0.21]
["SC_2099_A2","El Carmen 13.8",0.02]
["SC_2099_A2","Pasacaballos 1 13.8",0.25]
["SC_2099_A2","Pasacaballos 2 13.8",0.25]
["SC_2099_A2","Ternera 13.8",0.26]
["SC_2099_A2","Villa Estrella 13.8",1.94]
["SC_2099_A2","Bolivar 34.5",7.0000000000000007E-2]
["SC_2099_A2","Bosque 66",0.13]
["SC_2099_A2","Bayunca 66",0.05]
["SC_2099_A2","Bgrande 66",0.09]
["SC_2099_A2","Calamar 66",0.01]
["SC_2099_A2","Campestre 66",0.13]
["SC_2099_A2","Carreto 66",0.02]
["SC_2099_A2","Cartagena 66",0.11]
["SC_2099_A2","Chambacu 66",0.09]
["SC_2099_A2","Cospique 66",0.11]
["SC_2099_A2","El Carmen 66",0.01]
["SC_2099_A2","Gambote 66",0.02]
["SC_2099_A2","La Marina 66",0.1]
["SC_2099_A2","Mamonal 66",0.06]
["SC_2099_A2","Membrillal 66",0.09]
["SC_2099_A2","Proelectrica 66",0.12]
["SC_2099_A2","Ternera 66",0.21]
["SC_2099_A2","Bolivar 66",0.13]
["SC_2099_A2","Manzanillo 66",0.03]
["SC_2099_A2","San Jacinto 66",0.01]
["SC_2099_A2","Villa Estrella 66",0.26]
["SC_2099_A2","Zaragocilla 66",0.09]
["SC_2099_A2","Zambrano 66",0.01]
["SC_2099_A2","Argos 110",0.03]
["SC_2099_A2","El Carmen 110",0]
["SC_2099_A2","Nva Toluviejo 110",0.02]
["SC_2099_A2","Nv Cospique 110",0.04]
["SC_2099_A2","Pasacaballos 110",0.04]
["SC_2099_A2","Ternera 110",0.02]
["SC_2099_A2","Turbaco 110",0.02]
["SC_2099_A2","Bosque 220",0.06]
["SC_2099_A2","Candelaria 220",0.08]
["SC_2099_A2","Cartagena 220",0.08]
["SC_2099_A2","Ternera 220",7.0000000000000007E-2]
["SC_2099_A2","Pasacaballos 220",0.03]
["SC_2099_A2","Sabanalarga 220",0.05]
["SC_2099_A2","Bolivar 220",0.09]
["SC_2099_A2","Toluviejo 220",0.01]
["SC_2099_A2","Carreto 500",0.02]
["SC_2099_A2","Bolivar 500",0.03]
["SC_2099_A2","Sierra Flor 110",0.02]
["SC_1753_A2","Bolivar 220",0.14000000000000001]
["SC_1753_A2","Bolivar 500",0.02]
["SC_1753_A2","Carreto 500",0.01]
["SC_1753_A2","Pasacaballos 110",0.01]
["SC_1753_A2","Pasacaballos 220",0.01]
["SC_1753_A2","Sabanalarga 220",0.04]
["SC_1753_A2","Sabanalarga 500",0.02]
["SC_1753_A2","Ternera 110",0]
["SC_1753_A2","Ternera 220",0]
["SC_1753_A2","Toluviejo 220",0]
["SC_1753_A2","Turbaco 110",0]
["SC_1776_A1","Carreto 500",8.0000000000008953E-3]
["SC_1776_A1","Cartagena 220",4.0000000000013358E-3]
["SC_1776_A1","Candelaria 220",3.0000000000001137E-3]
["SC_1776_A1","Bolivar 220",4.9999999999990052E-3]
["SC_1776_A1","Sabanalarga 220",7.9999999999955662E-3]
["SC_1776_A1","Sabanalarga 500",6.0000000000002274E-3]
["SC_1776_A1","Bolivar 500",3.9999999999995595E-3]
["SC_1776_A1","Ternera 220",3.0000000000001137E-3]
["SC_1776_A1","Toluviejo 110",1.699999999999946E-2]
["SC_1776_A1","Pasacaballos 220",1.9999999999988916E-3]
["SC_1776_A1","Pasacaballos 110",1.9999999999988916E-3]
["SC_1776_A1","Toluviejo 220",5.0000000000007816E-3]
["SC_1776_A1","Ternera 110",1.000000000000334E-3]
["SC_1776_A1","Turbaco 110",9.9999999999944578E-4]
["SC_1776_A1","Zambrano 13.8",1.0389999999999997]
["SC_1776_A1","Zambrano 34.5",0.41999999999999993]
["SC_1776_A1","Zambrano 66",0.18300000000000027]
["SC_1776_A1","El Carmen 66",0.11099999999999977]
["SC_1776_A1","El Carmen 13.8",0.28800000000000026]
["SC_1776_A1","El Carmen 110",3.2999999999999918E-2]
["SC_1776_A1","San Jacinto 66",0.11600000000000055]
["SC_1776_A1","Carreto 66",4.9000000000003041E-2]
["SC_1776_A1","Candelaria 110",1.0000000000012221E-3]
["SC_1776_A1","Argos 110",1.0000000000012221E-3]
["SC_1776_A1","Calamar 66",1.000000000000334E-3]
["SC_1776_A2","Carreto 500",7.0000000000014495E-3]
["SC_1776_A2","Cartagena 220",3.0000000000001137E-3]
["SC_1776_A2","Candelaria 220",3.0000000000001137E-3]
["SC_1776_A2","Bolivar 220",4.9999999999990052E-3]
["SC_1776_A2","Sabanalarga 220",7.9999999999955662E-3]
["SC_1776_A2","Sabanalarga 500",6.0000000000002274E-3]
["SC_1776_A2","Bolivar 500",3.9999999999995595E-3]
["SC_1776_A2","Ternera 220",3.0000000000001137E-3]
["SC_1776_A2","Toluviejo 110",1.699999999999946E-2]
["SC_1776_A2","Pasacaballos 220",1.9999999999988916E-3]
["SC_1776_A2","Pasacaballos 110",1.9999999999988916E-3]
["SC_1776_A2","Toluviejo 220",5.0000000000007816E-3]
["SC_1776_A2","Ternera 110",1.000000000000334E-3]
["SC_1776_A2","Turbaco 110",9.9999999999944578E-4]
["SC_1776_A2","Zambrano 13.8",0.96199999999999974]
["SC_1776_A2","Zambrano 34.5",0.26799999999999979]
["SC_1776_A2","Zambrano 66",0.17900000000000027]
["SC_1776_A2","El Carmen 66",0.10899999999999999]
["SC_1776_A2","El Carmen 13.8",0.28300000000000125]
["SC_1776_A2","El Carmen 110",3.2000000000000028E-2]
["SC_1776_A2","San Jacinto 66",0.11400000000000077]
["SC_1776_A2","Carreto 66",4.8000000000001819E-2]
["SC_1776_A2","Candelaria 110",1.0000000000012221E-3]
["SC_1776_A2","Argos 110",1.0000000000012221E-3]
["SC_1776_A2","Calamar 66",1.000000000000334E-3]
["SC_588_A1","Carreto 500",4.7600000000009857E-3]
["SC_588_A1","Cartagena 220",2.3899999999983379E-3]
["SC_588_A1","Candelaria 220",2.3000000000017451E-3]
["SC_588_A1","Bolivar 220",3.6999999999984823E-3]
["SC_588_A1","Sabanalarga 220",4.8000000000030241E-3]
["SC_588_A1","Sabanalarga 500",3.9999999999995595E-3]
["SC_588_A1","Bolivar 500",2.1000000000004349E-3]
["SC_588_A1","Ternera 220",2.0699999999997942E-3]
["SC_588_A1","Toluviejo 110",1.5089999999998938E-2]
["SC_588_A1","Pasacaballos 220",1.4100000000016877E-3]
["SC_588_A1","Pasacaballos 110",1.300000000000523E-3]
["SC_588_A1","Toluviejo 220",4.0599999999990644E-3]
["SC_588_A1","Ternera 110",2.899999999996794E-4]
["SC_588_A1","Turbaco 110",3.3900000000031127E-4]
["SC_588_A1","Zambrano 13.8",5.6860000000000355E-2]
["SC_588_A1","Zambrano 34.5",1.5183000000000391E-2]
["SC_588_A1","Zambrano 66",2.5427000000000088E-2]
["SC_588_A1","El Carmen 66",0.11720800000000065]
["SC_588_A1","El Carmen 13.8",0.56259000000000015]
["SC_588_A1","El Carmen 110",2.9037000000000202E-2]
["SC_588_A1","San Jacinto 66",6.2047999999999881E-2]
["SC_588_A1","Carreto 66",2.7850000000000819E-2]
["SC_588_A1","Candelaria 110",6.7000000000128068E-4]
["SC_588_A1","Argos 110",5.8999999999898023E-4]
["SC_588_A1","Calamar 66",6.1499999999981014E-4]
["SC_588_A2","Carreto 500",5.0600000000002865E-3]
["SC_588_A2","Cartagena 220",2.6399999999995316E-3]
["SC_588_A2","Candelaria 220",2.5400000000033174E-3]
["SC_588_A2","Bolivar 220",4.0899999999979286E-3]
["SC_588_A2","Sabanalarga 220",5.2000000000020918E-3]
["SC_588_A2","Sabanalarga 500",4.3199999999998795E-3]
["SC_588_A2","Bolivar 500",2.2800000000007259E-3]
["SC_588_A2","Ternera 220",2.2799999999989495E-3]
["SC_588_A2","Toluviejo 110",1.778999999999975E-2]
["SC_588_A2","Pasacaballos 220",1.6000000000016001E-3]
["SC_588_A2","Pasacaballos 110",1.480000000000814E-3]
["SC_588_A2","Toluviejo 220",4.7399999999999665E-3]
["SC_588_A2","Ternera 110",3.2999999999994145E-4]
["SC_588_A2","Turbaco 110",3.7900000000057332E-4]
["SC_588_A2","Zambrano 13.8",5.8059999999999334E-2]
["SC_588_A2","Zambrano 34.5",1.5503000000000267E-2]
["SC_588_A2","Zambrano 66",2.5987000000000204E-2]
["SC_588_A2","El Carmen 66",0.11969800000000053]
["SC_588_A2","El Carmen 13.8",0.30856999999999957]
["SC_588_A2","El Carmen 110",3.4797000000000189E-2]
["SC_588_A2","San Jacinto 66",6.343800000000055E-2]
["SC_588_A2","Carreto 66",2.8940000000002186E-2]
["SC_588_A2","Candelaria 110",7.5000000000002842E-4]
["SC_588_A2","Argos 110",6.599999999998829E-4]
["SC_588_A2","Calamar 66",6.4499999999956259E-4]
["SC_1909_A1","Bolivar 220",0.84999999999999787]
["SC_1909_A1","Bolivar 500",0.24000000000000021]
["SC_1909_A1","Bosque 220",0.48999999999999844]
["SC_1909_A1","Candelaria 220",0.62000000000000099]
["SC_1909_A1","Cartagena 220",0.65000000000000213]
["SC_1909_A1","Sabanalarga 220",0.47000000000000242]
["SC_1909_A1","Sabanalarga 500",0.21999999999999886]
["SC_1909_A1","Ternera 220",0.57999999999999829]
["SC_1909_A1","Carreto 500",0.13999999999999879]
["SC_1909_A1","Candelaria 110",0.37000000000000099]
["SC_1909_A1","Coveñas 110",9.9999999999999645E-2]
["SC_1909_A1","Nv Cospique 110",0.33999999999999986]
["SC_1909_A1","Sierra Flor 110",0.15000000000000036]
["SC_1909_A1","Toluviejo 110",0.16999999999999993]
["SC_1909_A1","Argos 110",0.33000000000000007]
["SC_1909_A1","El Carmen 110",4.9999999999999822E-2]
["SC_1909_A1","Nva Toluviejo 110",0.19000000000000128]
["SC_1909_A1","Pasacaballos 110",0.37999999999999901]
["SC_1909_A1","Ternera 110",0.20000000000000107]
["SC_1909_A1","Turbaco 110",0.23000000000000043]
["SC_1909_A2","Bolivar 220",0.55999999999999872]
["SC_1909_A2","Bolivar 500",0.37000000000000099]
["SC_1909_A2","Bosque 220",0.32999999999999829]
["SC_1909_A2","Candelaria 220",0.42000000000000171]
["SC_1909_A2","Cartagena 220",0.44000000000000128]
["SC_1909_A2","Sabanalarga 220",0.51000000000000156]
["SC_1909_A2","Sabanalarga 500",0.28999999999999915]
["SC_1909_A2","Ternera 220",0.39999999999999858]
["SC_1909_A2","Carreto 500",0.1899999999999995]
["SC_1909_A2","Candelaria 110",0.25999999999999979]
["SC_1909_A2","Coveñas 110",9.9999999999999645E-2]
["SC_1909_A2","Nv Cospique 110",0.24000000000000021]
["SC_1909_A2","Sierra Flor 110",0.16000000000000014]
["SC_1909_A2","Toluviejo 110",0.16000000000000014]
["SC_1909_A2","Argos 110",0.23000000000000043]
["SC_1909_A2","El Carmen 110",4.9999999999999822E-2]
["SC_1909_A2","Nva Toluviejo 110",0.19000000000000128]
["SC_1909_A2","Pasacaballos 110",0.25999999999999979]
["SC_1909_A2","Ternera 110",0.14000000000000057]
["SC_1909_A2","Turbaco 110",0.16000000000000014]
["SC_1903_A1","Bolivar 220",0.06]
["SC_1903_A1","Bolivar 500",0.05]
["SC_1903_A1","Bosque 220",0.01]
["SC_1903_A1","Carreto 500",0.26]
["SC_1903_A1","Carreto 66",0.08]
["SC_1903_A1","Pasacaballos 220",0.01]
["SC_1903_A1","Sabanalarga 220",0.12]
["SC_1903_A1","Sabanalarga 500",0.14000000000000001]
["SC_1903_A1","Candelaria 220",0.02]
["SC_1903_A1","Cartagena 220",0.03]
["SC_1903_A1","Ternera 220",0.02]
["SC_1903_A1","Toluviejo 220",0.01]
["SC_1903_A2","Bolivar 220",0]
["SC_1903_A2","Bolivar 500",0]
["SC_1903_A2","Bosque 220",0]
["SC_1903_A2","Carreto 500",0.01]
["SC_1903_A2","Carreto 66",0.59]
["SC_1903_A2","Pasacaballos 110",0]
["SC_1903_A2","Pasacaballos 220",0]
["SC_1903_A2","Sabanalarga 220",0]
["SC_1903_A2","Sabanalarga 500",0]
["SC_1903_A2","Candelaria 220",0]
["SC_1903_A2","Cartagena 220",0]
["SC_1903_A2","Ternera 110",0]
["SC_1903_A2","Ternera 220",0]
["SC_1903_A2","Toluviejo 220",0]
["SC_1903_A2","Turbaco 110",0.02]
["SC_2003_A1","Bolivar 500",0.01]
["SC_2003_A1","Sabanalarga 500",0.01]
["SC_2003_A1","Bolivar 220",0.06]
["SC_2003_A1","Bosque 220",0.02]
["SC_2003_A1","Candelaria 220",0.03]
["SC_2003_A1","Cartagena 220",0.03]
["SC_2003_A1","Pasacaballos 220",0.01]
["SC_2003_A1","Sabanalarga 220",0.01]
["SC_2003_A1","Ternera 220",0.03]
["SC_2003_A1","Bayunca 66",0.03]
["SC_2003_A1","Bgrande 66",0.02]
["SC_2003_A1","Bolivar 66",0.24]
["SC_2003_A1","Bosque 66",0.03]
["SC_2003_A1","Campestre 66",0.02]
["SC_2003_A1","Cartagena 66",0.02]
["SC_2003_A1","Chambacu 66",0.02]
["SC_2003_A1","Cospique 66",0.01]
["SC_2003_A1","La Marina 66",0.02]
["SC_2003_A1","Manzanillo 66",0.03]
["SC_2003_A1","Membrillal 66",0.01]
["SC_2003_A1","Ternera 66",0.03]
["SC_2003_A1","Villa Estrella 66",0.03]
["SC_2003_A1","Zaragocilla 66",0.01]
["SC_2003_A2","Bolivar 500",0.01]
["SC_2003_A2","Bolivar 220",0.04]
["SC_2003_A2","Bosque 220",0.01]
["SC_2003_A2","Candelaria 220",0.02]
["SC_2003_A2","Cartagena 220",0.02]
["SC_2003_A2","Sabanalarga 220",0.01]
["SC_2003_A2","Ternera 220",0.02]
["SC_2003_A2","Bayunca 66",0.1]
["SC_2003_A2","Bgrande 66",0.01]
["SC_2003_A2","Bolivar 66",0.15]
["SC_2003_A2","Bosque 66",0.02]
["SC_2003_A2","Campestre 66",0.01]
["SC_2003_A2","Cartagena 66",0.01]
["SC_2003_A2","Chambacu 66",0.01]
["SC_2003_A2","Cospique 66",0.01]
["SC_2003_A2","La Marina 66",0.01]
["SC_2003_A2","Manzanillo 66",0.16]
["SC_2003_A2","Membrillal 66",0.01]
["SC_2003_A2","Ternera 66",0.02]
["SC_2003_A2","Villa Estrella 66",0.02]
["SC_2097_A1","Bolivar 500",0.01]
["SC_2097_A1","Sabanalarga 500",0.01]
["SC_2097_A1","Bolivar 220",0.06]
["SC_2097_A1","Bosque 220",0.02]
["SC_2097_A1","Candelaria 220",0.03]
["SC_2097_A1","Cartagena 220",0.03]
["SC_2097_A1","Pasacaballos 220",0.01]
["SC_2097_A1","Sabanalarga 220",0.01]
["SC_2097_A1","Ternera 220",0.03]
["SC_2097_A1","Bayunca 66",0.03]
["SC_2097_A1","Bgrande 66",0.02]
["SC_2097_A1","Bolivar 66",0.24]
["SC_2097_A1","Bosque 66",0.03]
["SC_2097_A1","Campestre 66",0.02]
["SC_2097_A1","Cartagena 66",0.02]
["SC_2097_A1","Chambacu 66",0.02]
["SC_2097_A1","Cospique 66",0.01]
["SC_2097_A1","La Marina 66",0.02]
["SC_2097_A1","Manzanillo 66",0.03]
["SC_2097_A1","Membrillal 66",0.01]
["SC_2097_A1","Ternera 66",0.03]
["SC_2097_A1","Villa Estrella 66",0.03]
["SC_2097_A1","Zaragocilla 66",0.01]
["SC_2097_A2","Bolivar 500",0.01]
["SC_2097_A2","Bolivar 220",0.04]
["SC_2097_A2","Bosque 220",0.01]
["SC_2097_A2","Candelaria 220",0.02]
["SC_2097_A2","Cartagena 220",0.02]
["SC_2097_A2","Pasacaballos 220",0.01]
["SC_2097_A2","Sabanalarga 220",0.01]
["SC_2097_A2","Ternera 220",0.02]
["SC_2097_A2","Bayunca 66",0.1]
["SC_2097_A2","Bgrande 66",0.01]
["SC_2097_A2","Bolivar 66",0.15]
["SC_2097_A2","Bosque 66",0.02]
["SC_2097_A2","Campestre 66",0.01]
["SC_2097_A2","Cartagena 66",0.01]
["SC_2097_A2","Chambacu 66",0.01]
["SC_2097_A2","Cospique 66",0.01]
["SC_2097_A2","La Marina 66",0.01]
["SC_2097_A2","Manzanillo 66",0.16]
["SC_2097_A2","Membrillal 66",0.01]
["SC_2097_A2","Ternera 66",0.02]
["SC_2097_A2","Villa Estrella 66",0.02]
["SC_2285_A1","Candelaria 110",0.01]
["SC_2285_A1","Bgrande 66",0.05]
["SC_2285_A1","Bolivar 66",0.01]
["SC_2285_A1","Bosque 66",0.08]
["SC_2285_A1","Campestre 66",0.09]
["SC_2285_A1","Cartagena 66",7.0000000000000007E-2]
["SC_2285_A1","Chambacu 66",0.05]
["SC_2285_A1","Cospique 66",0.05]
["SC_2285_A1","La Marina 66",7.0000000000000007E-2]
["SC_2285_A1","Mamonal 66",0.02]
["SC_2285_A1","Membrillal 66",0.04]
["SC_2285_A1","Ternera 66",0.2]
["SC_2285_A1","Villa Estrella 66",0.02]
["SC_2285_A1","Zaragocilla 66",0.03]
["SC_2000_A1","Bolivar 220",0.02]
["SC_2000_A1","Bosque 220",0.02]
["SC_2000_A1","Candelaria 220",0.02]
["SC_2000_A1","Cartagena 220",0.02]
["SC_2000_A1","Sabanalarga 220",0.01]
["SC_2000_A1","Ternera 220",0.02]
["SC_2000_A1","Bgrande 66",0.08]
["SC_2000_A1","Bosque 66",0.08]
["SC_2000_A1","Campestre 66",0.03]
["SC_2000_A1","Cartagena 66",0.13]
["SC_2000_A1","Chambacu 66",7.0000000000000007E-2]
["SC_2000_A1","Cospique 66",0.02]
["SC_2000_A1","La Marina 66",0.11]
["SC_2000_A1","Mamonal 66",0.01]
["SC_2000_A1","Membrillal 66",0.03]
["SC_2000_A1","Ternera 66",0.04]
["SC_2000_A1","Villa Estrella 66",0.01]
["SC_2000_A1","Zaragocilla 66",0.01]
["SC_2000_A2","Bolivar 220",0.03]
["SC_2000_A2","Bosque 220",0.01]
["SC_2000_A2","Candelaria 220",0.03]
["SC_2000_A2","Cartagena 220",0.04]
["SC_2000_A2","Sabanalarga 220",0.01]
["SC_2000_A2","Ternera 220",0.03]
["SC_2000_A2","Bgrande 66",0.01]
["SC_2000_A2","Bosque 66",0.01]
["SC_2000_A2","Campestre 66",0.01]
["SC_2000_A2","Cartagena 66",0.01]
["SC_2000_A2","Chambacu 66",0.01]
["SC_2000_A2","La Marina 66",0.01]
["SC_2000_A2","Ternera 66",0.01]
["SC_2336_A1","Argos 110",0.06]
["SC_2336_A1","Bosque 220",0.02]
["SC_2336_A1","Candelaria 110",0.06]
["SC_2336_A1","Carreto 500",0]
["SC_2336_A1","El Carmen 110",0]
["SC_2336_A1","Sierra Flor 110",0]
["SC_2336_A1","Pasacaballos 110",0.19]
["SC_2336_A1","Pasacaballos 220",0.04]
["SC_2336_A1","Sabanalarga 220",0.02]
["SC_2336_A1","Sabanalarga 500",0.01]
["SC_2336_A1","Ternera 110",0.03]
["SC_2336_A1","Toluviejo 220",0.01]
["SC_2336_A1","Turbaco 110",0.05]
["SC_2336_A2","Argos 110",0.05]
["SC_2336_A2","Bosque 220",0.02]
["SC_2336_A2","Candelaria 110",0.05]
["SC_2336_A2","Carreto 500",0]
["SC_2336_A2","El Carmen 110",0]
["SC_2336_A2","Sierra Flor 110",0]
["SC_2336_A2","Pasacaballos 110",0.12]
["SC_2336_A2","Pasacaballos 220",0.03]
["SC_2336_A2","Sabanalarga 220",0.02]
["SC_2336_A2","Sabanalarga 500",0.01]
["SC_2336_A2","Ternera 110",0.13]
["SC_2336_A2","Toluviejo 220",0]
["SC_2336_A2","Turbaco 110",0.19]
["SC_2186_A1","Argos 110",0.17]
["SC_2186_A1","Bayunca 66",0.1]
["SC_2186_A1","Bgrande 66",0.43]
["SC_2186_A1","Bolivar 220",0.51]
["SC_2186_A1","Bolivar 500",0.32]
["SC_2186_A1","Bolivar 66",0.28000000000000003]
["SC_2186_A1","Bosque 220",0.28000000000000003]
["SC_2186_A1","Bosque 66",0.52]
["SC_2186_A1","Calamar 66",0.05]
["SC_2186_A1","Campestre 66",0.37]
["SC_2186_A1","Candelaria 110",0.23]
["SC_2186_A1","Candelaria 220",0.37]
["SC_2186_A1","Carreto 500",0.15]
["SC_2186_A1","Carreto 66",0.17]
["SC_2186_A1","Cartagena 220",0.37]
["SC_2186_A1","Cartagena 66",0.46]
["SC_2186_A1","Chambacu 66",0.42]
["SC_2186_A1","Cospique 66",0.23]
["SC_2186_A1","Coveñas 110",0.08]
["SC_2186_A1","El Carmen 110",0.04]
["SC_2186_A1","El Carmen 66",0.06]
["SC_2186_A1","Gambote 66",0.06]
["SC_2186_A1","La Marina 66",0.47]
["SC_2186_A1","Mamonal 66",0.15]
["SC_2186_A1","Manzanillo 66",0.1]
["SC_2186_A1","Membrillal 66",0.25]
["SC_2186_A1","Nv Cospique 110",0.18]
["SC_2186_A1","Nva Toluviejo 110",0.18]
["SC_2186_A1","Pasacaballos 110",0.24]
["SC_2186_A1","Pasacaballos 220",0.17]
["SC_2186_A1","Proelectrica 66",0.36]
["SC_2186_A1","Sabanalarga 220",0.46]
["SC_2186_A1","Sabanalarga 500",0.25]
["SC_2186_A1","San Jacinto 66",0.06]
["SC_2186_A1","Sierra Flor 110",0.11]
["SC_2186_A1","Ternera 110",0.14000000000000001]
["SC_2186_A1","Ternera 220",0.33]
["SC_2186_A1","Ternera 66",0.42]
["SC_2186_A1","Toluviejo 110",0.14000000000000001]
["SC_2186_A1","Toluviejo 220",0.11]
["SC_2186_A1","Turbaco 110",0.12]
["SC_2186_A1","Villa Estrella 66",0.2]
["SC_2186_A1","Zambrano 66",0.03]
["SC_2186_A1","Zaragocilla 66",0.19]
["SC_2186_A2","Argos 110",0.24]
["SC_2186_A2","Bayunca 66",0.16]
["SC_2186_A2","Bgrande 66",0.65]
["SC_2186_A2","Bolivar 220",0.78]
["SC_2186_A2","Bolivar 500",0.2]
["SC_2186_A2","Bolivar 66",0.43]
["SC_2186_A2","Bosque 220",0.43]
["SC_2186_A2","Bosque 66",0.77]
["SC_2186_A2","Calamar 66",0.04]
["SC_2186_A2","Campestre 66",0.55000000000000004]
["SC_2186_A2","Candelaria 110",0.34]
["SC_2186_A2","Candelaria 220",0.54]
["SC_2186_A2","Carreto 500",0.11]
["SC_2186_A2","Carreto 66",0.14000000000000001]
["SC_2186_A2","Cartagena 220",0.56000000000000005]
["SC_2186_A2","Cartagena 66",0.69]
["SC_2186_A2","Chambacu 66",0.63]
["SC_2186_A2","Cospique 66",0.35]
["SC_2186_A2","Coveñas 110",7.0000000000000007E-2]
["SC_2186_A2","El Carmen 110",0.03]
["SC_2186_A2","El Carmen 66",0.05]
["SC_2186_A2","Gambote 66",7.0000000000000007E-2]
["SC_2186_A2","La Marina 66",0.7]
["SC_2186_A2","Mamonal 66",0.23]
["SC_2186_A2","Manzanillo 66",0.15]
["SC_2186_A2","Membrillal 66",0.37]
["SC_2186_A2","Nv Cospique 110",0.26]
["SC_2186_A2","Nva Toluviejo 110",0.18]
["SC_2186_A2","Pasacaballos 110",0.35]
["SC_2186_A2","Pasacaballos 220",0.26]
["SC_2186_A2","Proelectrica 66",0.54]
["SC_2186_A2","Sabanalarga 220",0.42]
["SC_2186_A2","Sabanalarga 500",0.19]
["SC_2186_A2","San Jacinto 66",0.05]
["SC_2186_A2","Sierra Flor 110",0.11]
["SC_2186_A2","Ternera 110",0.2]
["SC_2186_A2","Ternera 220",0.49]
["SC_2186_A2","Ternera 66",0.62]
["SC_2186_A2","Toluviejo 110",0.14000000000000001]
["SC_2186_A2","Toluviejo 220",0.11]
["SC_2186_A2","Turbaco 110",0.17]
["SC_2186_A2","Villa Estrella 66",0.28999999999999998]
["SC_2186_A2","Zambrano 66",0.03]
["SC_2186_A2","Zaragocilla 66",0.28999999999999998]
["SC_2216_A1","Bolivar 500",0.95]
["SC_2216_A1","Bolivar 220",3.8]
["SC_2216_A1","Cartagena 220",2.77]
["SC_2216_A1","Pasacaballos 220",1.29]
["SC_2216_A1","Toluviejo 220",0.56999999999999995]
["SC_2216_A1","Argos 110",1.19]
["SC_2216_A1","Nva Toluviejo 110",0.95]
["SC_2216_A1","Pasacaballos 110",1.75]
["SC_2216_A1","Ternera 110",1.04]
["SC_2216_A1","Turbaco 110",0.86]
["SC_2216_A1","Bayunca 66",8.67]
["SC_2216_A1","Bolivar 66",10.52]
["SC_2216_A1","Campestre 66",2.39]
["SC_2216_A1","Cartagena 66",2.4300000000000002]
["SC_2216_A1","Manzanillo 66",10.51]
["SC_2216_A1","Villa Estrella 66",3.56]
["SC_2216_A1","Manzanillo 13.8",31.96]
["SC_2216_A2","Bolivar 500",0.95]
["SC_2216_A2","Bolivar 220",3.8]
["SC_2216_A2","Cartagena 220",2.77]
["SC_2216_A2","Pasacaballos 220",1.29]
["SC_2216_A2","Toluviejo 220",0.56999999999999995]
["SC_2216_A2","Argos 110",1.19]
["SC_2216_A2","Nva Toluviejo 110",0.95]
["SC_2216_A2","Pasacaballos 110",1.75]
["SC_2216_A2","Ternera 110",1.04]
["SC_2216_A2","Turbaco 110",0.86]
["SC_2216_A2","Bayunca 66",10.52]
["SC_2216_A2","Bolivar 66",10.52]
["SC_2216_A2","Campestre 66",2.39]
["SC_2216_A2","Cartagena 66",2.4300000000000002]
["SC_2216_A2","Manzanillo 66",8.1199999999999992]
["SC_2216_A2","Villa Estrella 66",3.56]
["SC_2216_A2","Manzanillo 13.8",24.7]
["SC_2187_A1","Argos 110",0.06]
["SC_2187_A1","Bosque 220",0.02]
["SC_2187_A1","Candelaria 110",0.06]
["SC_2187_A1","Carreto 500",0]
["SC_2187_A1","El Carmen 110",0]
["SC_2187_A1","Sierra Flor 110",0]
["SC_2187_A1","Pasacaballos 110",0.19]
["SC_2187_A1","Pasacaballos 220",0.04]
["SC_2187_A1","Sabanalarga 220",0.02]
["SC_2187_A1","Sabanalarga 500",0.01]
["SC_2187_A2","Argos 110",0.05]
["SC_2187_A2","Bosque 220",0.02]
["SC_2187_A2","Candelaria 110",0.05]
["SC_2187_A2","Carreto 500",0]
["SC_2187_A2","El Carmen 110",0]
["SC_2187_A2","Sierra Flor 110",0]
["SC_2187_A2","Pasacaballos 110",0.12]
["SC_2187_A2","Pasacaballos 220",0.03]
["SC_2187_A2","Sabanalarga 220",0.02]
["SC_2187_A2","Sabanalarga 500",0.01]
["SC_1220_A1","Bolivar 500",0.19]
["SC_1220_A1","Bolivar 220",0.15]
["SC_1220_A1","Cartagena 220",0.09]
["SC_1220_A1","Cartagena 66",-2.13]
["SC_1220_A1","Pasacaballos 110",0.01]
["SC_1220_A1","Pasacaballos 220",0.01]
["SC_1220_A1","Sabanalarga 220",0.14000000000000001]
["SC_1220_A1","Sabanalarga 500",0.1]
["SC_1220_A1","Ternera 110",0.01]
["SC_1220_A1","Toluviejo 220",0]
["SC_1220_A1","Turbaco 110",0.01]
["SC_1220_A2","Bolivar 500",1.33]
["SC_1220_A2","Bolivar 220",1.92]
["SC_1220_A2","Cartagena 220",0.68]
["SC_1220_A2","Cartagena 66",-1.99]
["SC_1220_A2","Pasacaballos 110",7.0000000000000007E-2]
["SC_1220_A2","Pasacaballos 220",0.09]
["SC_1220_A2","Sabanalarga 220",0.18]
["SC_1220_A2","Sabanalarga 500",1.3]
["SC_1220_A2","Ternera 110",0.05]
["SC_1220_A2","Toluviejo 220",0]
["SC_1220_A2","Turbaco 110",0.03]
["SC_1758_A1","Bolivar 500",0.17]
["SC_1758_A1","Carreto 500",0.02]
["SC_1758_A1","Sabanalarga 500",0.08]
["SC_1758_A1","Bolivar 220",0.12]
["SC_1758_A1","Bosque 220",0.03]
["SC_1758_A1","Candelaria 220",0.06]
["SC_1758_A1","Cartagena 220",0.06]
["SC_1758_A1","Pasacaballos 220",0.01]
["SC_1758_A1","Sabanalarga 220",0.1]
["SC_1758_A1","Ternera 220",0.05]
["SC_1758_A1","Toluviejo 220",0]
["SC_1758_A1","Argos 110",0.01]
["SC_1758_A1","Bayunca 66",0]
["SC_1758_A1","Bgrande 66",0.02]
["SC_1758_A1","Bolivar 66",0.01]
["SC_1758_A1","Bosque 66",0.04]
["SC_1758_A1","Calamar 66",0]
["SC_1758_A1","Campestre 66",0.02]
["SC_1758_A1","Candelaria 110",0.01]
["SC_1758_A1","Carreto 66",0.02]
["SC_1758_A1","Cartagena 66",0.03]
["SC_1758_A1","Chambacu 66",0.02]
["SC_1758_A1","Cospique 66",0.01]
["SC_1758_A1","La Marina 66",0.03]
["SC_1758_A1","Mamonal 66",0]
["SC_1758_A1","Manzanillo 66",0]
["SC_1758_A1","Membrillal 66",0.01]
["SC_1758_A1","Nva Toluviejo 110",0]
["SC_1758_A1","Nv Cospique 110",0.01]
["SC_1758_A1","Pasacaballos 110",0.01]
["SC_1758_A1","San Jacinto 66",0]
["SC_1758_A1","Ternera 110",0]
["SC_1758_A1","Ternera 66",0.02]
["SC_1758_A1","Toluviejo 110",0]
["SC_1758_A1","Turbaco 110",0]
["SC_1758_A1","Villa Estrella 66",0.01]
["SC_1758_A1","Zambrano 66",0]
["SC_1758_A1","Zaragocilla 66",0.01]
["SC_1758_A2","Bolivar 500",0.06]
["SC_1758_A2","Carreto 500",0.01]
["SC_1758_A2","Sabanalarga 500",0.04]
["SC_1758_A2","Bolivar 220",0.39]
["SC_1758_A2","Bosque 220",0.1]
["SC_1758_A2","Candelaria 220",0.17]
["SC_1758_A2","Cartagena 220",0.19]
["SC_1758_A2","Pasacaballos 220",0.04]
["SC_1758_A2","Sabanalarga 220",0.09]
["SC_1758_A2","Ternera 220",0.15]
["SC_1758_A2","Toluviejo 220",0]
["SC_1758_A2","Argos 110",0.02]
["SC_1758_A2","Bayunca 66",0.01]
["SC_1758_A2","Bgrande 66",7.0000000000000007E-2]
["SC_1758_A2","Bolivar 66",0.04]
["SC_1758_A2","Bosque 66",0.12]
["SC_1758_A2","Calamar 66",0]
["SC_1758_A2","Campestre 66",0.05]
["SC_1758_A2","Candelaria 110",0.03]
["SC_1758_A2","Carreto 66",0.01]
["SC_1758_A2","Cartagena 66",0.08]
["SC_1758_A2","Chambacu 66",0.06]
["SC_1758_A2","Cospique 66",0.02]
["SC_1758_A2","La Marina 66",0.08]
["SC_1758_A2","Mamonal 66",0.01]
["SC_1758_A2","Manzanillo 66",0]
["SC_1758_A2","Membrillal 66",0.03]
["SC_1758_A2","Nva Toluviejo 110",0]
["SC_1758_A2","Nv Cospique 110",0.02]
["SC_1758_A2","Pasacaballos 110",0.03]
["SC_1758_A2","San Jacinto 66",0]
["SC_1758_A2","Ternera 110",0.01]
["SC_1758_A2","Ternera 66",0.08]
["SC_1758_A2","Toluviejo 110",0]
["SC_1758_A2","Turbaco 110",0.01]
["SC_1758_A2","Villa Estrella 66",0.02]
["SC_1758_A2","Zambrano 66",0]
["SC_1758_A2","Zaragocilla 66",0.02]
["SC_1760_A1","Bolivar 500",0.17]
["SC_1760_A1","Carreto 500",0.02]
["SC_1760_A1","Sabanalarga 500",0.08]
["SC_1760_A1","Bolivar 220",0.12]
["SC_1760_A1","Bosque 220",0.03]
["SC_1760_A1","Candelaria 220",0.06]
["SC_1760_A1","Cartagena 220",0.06]
["SC_1760_A1","Pasacaballos 220",0.01]
["SC_1760_A1","Sabanalarga 220",0.1]
["SC_1760_A1","Ternera 220",0.05]
["SC_1760_A1","Toluviejo 220",0]
["SC_1760_A1","Argos 110",0.01]
["SC_1760_A1","Bayunca 66",0]
["SC_1760_A1","Bgrande 66",0.02]
["SC_1760_A1","Bolivar 66",0.01]
["SC_1760_A1","Bosque 66",0.04]
["SC_1760_A1","Calamar 66",0]
["SC_1760_A1","Campestre 66",0.02]
["SC_1760_A1","Candelaria 110",0.01]
["SC_1760_A1","Carreto 66",0.02]
["SC_1760_A1","Cartagena 66",0.03]
["SC_1760_A1","Chambacu 66",0.02]
["SC_1760_A1","Cospique 66",0.01]
["SC_1760_A1","El Carmen 110",0]
["SC_1760_A1","El Carmen 66",0]
["SC_1760_A1","Gambote 66",0]
["SC_1760_A1","La Marina 66",0.03]
["SC_1760_A1","Mamonal 66",0]
["SC_1760_A1","Manzanillo 66",0]
["SC_1760_A1","Membrillal 66",0.01]
["SC_1760_A1","Nva Toluviejo 110",0]
["SC_1760_A1","Nv Cospique 110",0.01]
["SC_1760_A1","Pasacaballos 110",0.01]
["SC_1760_A1","San Jacinto 66",0]
["SC_1760_A1","Ternera 110",0]
["SC_1760_A1","Ternera 66",0.02]
["SC_1760_A1","Toluviejo 110",0]
["SC_1760_A1","Turbaco 110",0]
["SC_1760_A1","Villa Estrella 66",0.01]
["SC_1760_A1","Zambrano 66",0]
["SC_1760_A1","Zaragocilla 66",0.01]
["SC_1760_A2","Bolivar 500",0.06]
["SC_1760_A2","Carreto 500",0.01]
["SC_1760_A2","Sabanalarga 500",0.04]
["SC_1760_A2","Bolivar 220",0.39]
["SC_1760_A2","Bosque 220",0.1]
["SC_1760_A2","Candelaria 220",0.17]
["SC_1760_A2","Cartagena 220",0.19]
["SC_1760_A2","Pasacaballos 220",0.04]
["SC_1760_A2","Sabanalarga 220",0.09]
["SC_1760_A2","Ternera 220",0.15]
["SC_1760_A2","Toluviejo 220",0]
["SC_1760_A2","Argos 110",0.02]
["SC_1760_A2","Bayunca 66",0.01]
["SC_1760_A2","Bgrande 66",7.0000000000000007E-2]
["SC_1760_A2","Bolivar 66",0.04]
["SC_1760_A2","Bosque 66",0.12]
["SC_1760_A2","Calamar 66",0]
["SC_1760_A2","Campestre 66",0.05]
["SC_1760_A2","Candelaria 110",0.03]
["SC_1760_A2","Carreto 66",0.01]
["SC_1760_A2","Cartagena 66",0.08]
["SC_1760_A2","Chambacu 66",0.06]
["SC_1760_A2","Cospique 66",0.02]
["SC_1760_A2","El Carmen 110",0]
["SC_1760_A2","El Carmen 66",0]
["SC_1760_A2","Gambote 66",0]
["SC_1760_A2","La Marina 66",0.08]
["SC_1760_A2","Mamonal 66",0.01]
["SC_1760_A2","Manzanillo 66",0]
["SC_1760_A2","Membrillal 66",0.03]
["SC_1760_A2","Nva Toluviejo 110",0]
["SC_1760_A2","Nv Cospique 110",0.02]
["SC_1760_A2","Pasacaballos 110",0.03]
["SC_1760_A2","San Jacinto 66",0]
["SC_1760_A2","Ternera 110",0.01]
["SC_1760_A2","Ternera 66",0.08]
["SC_1760_A2","Toluviejo 110",0]
["SC_1760_A2","Turbaco 110",0.01]
["SC_1760_A2","Villa Estrella 66",0.02]
["SC_1760_A2","Zambrano 66",0]
["SC_1760_A2","Zaragocilla 66",0.02]
["SC_2140_A1","Nva Toluviejo 110",-0.01]
["SC_2140_A1","El Carmen 13.8",0.1]
["SC_2140_A1","San Jacinto 66",0.17]
["SC_2140_A1","El Carmen 66",0.15]
["SC_2140_A1","El Carmen 110",0]
["SC_2140_A1","Plato 13.8",0.2]
["SC_2140_A1","Zambrano 66",0.41]
["SC_2140_A1","Zambrano 34.5",0.85]
["SC_2140_A1","Plato 34.5",0.92]
["SC_2140_A2","Nva Toluviejo 110",-0.01]
["SC_2140_A2","El Carmen 13.8",0.1]
["SC_2140_A2","San Jacinto 66",0.17]
["SC_2140_A2","El Carmen 66",0.16]
["SC_2140_A2","El Carmen 110",0]
["SC_2140_A2","Plato 13.8",0.12]
["SC_2140_A2","Zambrano 66",0.43]
["SC_2140_A2","Zambrano 34.5",0.89]
["SC_2140_A2","Plato 34.5",0.72]

{"sheet":"zonas","index":6,"n_rows":221,"n_cols":4,"rows_kept":221,"cut":false,"hidden":false,"merged":[]}
["nombre","periodo","capacidad","factor"]
["Zona6",2023,123.09685681514431,1]
["Zona6",2024,135.59685681514429,1]
["Zona6",2025,33.899214203786087,1]
["Zona6",2026,33.899214203786087,1]
["Zona6",2027,33.899214203786087,1]
["Zona6",2028,33.744527129922403,1]
["Zona6",2029,33.744527129922403,1]
["Zona6",2030,33.744527129922403,1]
["Zona6",2031,50.424410652839569,1]
["Zona6",2032,50.424410652839569,1]
["Zona6",2033,50.424410652839569,1]
["Zona2",2023,120.9837312766447,1]
["Zona2",2024,112.68114407759199,1]
["Zona2",2025,28.520413896327401,1]
["Zona2",2026,28.520413896327401,1]
["Zona2",2027,28.520413896327401,1]
["Zona2",2028,28.520413896327401,1]
["Zona2",2029,28.520413896327401,1]
["Zona2",2030,35.398023723359017,1]
["Zona2",2031,54.148023723359017,1]
["Zona2",2032,77.233731276644704,1]
["Zona2",2033,77.233731276644704,1]
["Zona8",2023,139.39482571593331,1]
["Zona8",2024,90.009912857966668,1]
["Zona8",2025,25,1]
["Zona8",2026,25,1]
["Zona8",2027,25,1]
["Zona8",2028,25,1]
["Zona8",2029,25,1]
["Zona8",2030,35.002478214491667,1]
["Zona8",2031,60.002478214491667,1]
["Zona8",2032,72.502478214491674,1]
["Zona8",2033,72.502478214491674,1]
["Zona12",2023,0,1]
["Zona12",2024,0,1]
["Zona12",2025,0,1]
["Zona12",2026,300,1]
["Zona12",2027,300,1]
["Zona12",2028,300,1]
["Zona12",2029,300,1]
["Zona12",2030,300,1]
["Zona12",2031,300,1]
["Zona12",2032,300,1]
["Zona12",2033,300,1]
["Zona13",2023,130.62704930186351,1]
["Zona13",2024,136.87704930186351,1]
["Zona13",2025,31.613267736915841,1]
["Zona13",2026,31.613267736915841,1]
["Zona13",2027,31.613267736915841,1]
["Zona13",2028,31.613267736915841,1]
["Zona13",2029,31.613267736915841,1]
["Zona13",2030,31.613267736915841,1]
["Zona13",2031,54.564242416777937,1]
["Zona13",2032,75.664446744099394,1]
["Zona13",2033,75.664446744099394,1]
["Zona11",2023,191.98929875899569,1]
["Zona11",2024,204.48929875899569,1]
["Zona11",2025,25.561162344874461,1]
["Zona11",2026,25.561162344874461,1]
["Zona11",2027,25.561162344874461,1]
["Zona11",2028,25.561162344874461,1]
["Zona11",2029,25.561162344874461,1]
["Zona11",2030,35.15625,1]
["Zona11",2031,60.15625,1]
["Zona11",2032,75.561162344874447,1]
["Zona11",2033,75.561162344874447,1]
["Zona18",2023,0,1]
["Zona18",2024,8.203125,1]
["Zona18",2025,9.5703125,1]
["Zona18",2026,59.100151062011719,1]
["Zona18",2027,59.100151062011719,1]
["Zona18",2028,59.100151062011719,1]
["Zona18",2029,59.100151062011719,1]
["Zona18",2030,57.253271341323853,1]
["Zona18",2031,57.253271341323853,1]
["Zona18",2032,55.464106611907482,1]
["Zona18",2033,55.464106611907482,1]
["Zona20",2023,0,1]
["Zona20",2024,0,1]
["Zona20",2025,0,1]
["Zona20",2026,25,1]
["Zona20",2027,25,1]
["Zona20",2028,25,1]
["Zona20",2029,25,1]
["Zona20",2030,25,1]
["Zona20",2031,50,1]
["Zona20",2032,50,1]
["Zona20",2033,50,1]
["Zona4",2023,12.059966349443179,1]
["Zona4",2024,18.175744130329161,1]
["Zona4",2025,19.277922221453,1]
["Zona4",2026,51.074797221453068,1]
["Zona4",2027,51.074797221453082,1]
["Zona4",2028,51.465422221453082,1]
["Zona4",2029,51.465422221453082,1]
["Zona4",2030,51.856047221453082,1]
["Zona4",2031,51.856047221453082,1]
["Zona4",2032,52.637297221453082,1]
["Zona4",2033,52.637297221453082,1]
["Zona17",2023,144.56947914015171,1]
["Zona17",2024,146.13197914015171,1]
["Zona17",2025,27.399746088778439,1]
["Zona17",2026,27.399746088778439,1]
["Zona17",2027,27.399746088778439,1]
["Zona17",2028,27.399746088778439,1]
["Zona17",2029,27.399746088778439,1]
["Zona17",2030,27.399746088778439,1]
["Zona17",2031,52.399746088778443,1]
["Zona17",2032,77.399746088778443,1]
["Zona17",2033,77.399746088778443,1]
["Zona1",2023,69.56126854551087,1]
["Zona1",2024,33.69373945173183,1]
["Zona1",2025,10.93567480225456,1]
["Zona1",2026,19.765001766032739,1]
["Zona1",2027,19.765001766032739,1]
["Zona1",2028,19.14734546084421,1]
["Zona1",2029,19.14734546084421,1]
["Zona1",2030,19.14734546084421,1]
["Zona1",2031,18.548990915192832,1]
["Zona1",2032,17.96933494909306,1]
["Zona1",2033,17.96933494909306,1]
["Zona7",2023,188.90327196320101,1]
["Zona7",2024,195.15327196320109,1]
["Zona7",2025,69.794921875,1]
["Zona7",2026,69.794921875,1]
["Zona7",2027,69.794921875,1]
["Zona7",2028,69.794921875,1]
["Zona7",2029,69.794921875,1]
["Zona7",2030,69.794921875,1]
["Zona7",2031,69.794921875,1]
["Zona7",2032,74.394158995400119,1]
["Zona7",2033,74.394158995400119,1]
["Zona19",2023,16.481656804101739,1]
["Zona19",2024,21.95040680410175,1]
["Zona19",2025,22.871934291459901,1]
["Zona19",2026,24.68478180410175,1]
["Zona19",2027,26.24728180410175,1]
["Zona19",2028,26.247281804101739,1]
["Zona19",2029,28.59103180410175,1]
["Zona19",2030,29.76290680410175,1]
["Zona19",2031,31.32540680410175,1]
["Zona19",2032,32.106656804101753,1]
["Zona19",2033,31.604990291537661,1]
["Zona16",2023,0,1]
["Zona16",2024,0,1]
["Zona16",2025,9.375,1]
["Zona16",2026,9.375,1]
["Zona16",2027,9.375,1]
["Zona16",2028,9.375,1]
["Zona16",2029,9.375,1]
["Zona16",2030,9.375,1]
["Zona16",2031,9.375,1]
["Zona16",2032,9.375,1]
["Zona16",2033,9.375,1]
["Zona3",2023,115.32112200363829,1]
["Zona3",2024,116.10237200363829,1]
["Zona3",2025,29.025593000909581,1]
["Zona3",2026,29.025593000909581,1]
["Zona3",2027,29.025593000909581,1]
["Zona3",2028,29.025593000909581,1]
["Zona3",2029,29.025593000909581,1]
["Zona3",2030,29.025593000909581,1]
["Zona3",2031,54.025593000909581,1]
["Zona3",2032,76.351957227864943,1]
["Zona3",2033,76.351957227864943,1]
["Zona5",2023,7.9405835288866884,1]
["Zona5",2024,8.2530835288866875,1]
["Zona5",2025,8.3211997321772913,1]
["Zona5",2026,8.9377966270774891,1]
["Zona5",2027,9.2502966270774891,1]
["Zona5",2028,9.5627966270774891,1]
["Zona5",2029,9.8752966270774891,1]
["Zona5",2030,10.187796627077489,1]
["Zona5",2031,10.500296627077489,1]
["Zona5",2032,11.03637316645673,1]
["Zona5",2033,11.690583528886689,1]
["Zona15",2023,34.495563413277139,1]
["Zona15",2024,19.087198996790811,1]
["Zona15",2025,10.988032170009561,1]
["Zona15",2026,19.42396176874572,1]
["Zona15",2027,19.42396176874572,1]
["Zona15",2028,19.42396176874572,1]
["Zona15",2029,19.42396176874572,1]
["Zona15",2030,19.42396176874572,1]
["Zona15",2031,19.42396176874572,1]
["Zona15",2032,19.42396176874572,1]
["Zona15",2033,19.42396176874572,1]
["Zona10",2023,856.18884541227362,1]
["Zona10",2024,899.79233721670062,1]
["Zona10",2025,156.18884541227371,1]
["Zona10",2026,156.18884541227371,1]
["Zona10",2027,156.18884541227371,1]
["Zona10",2028,156.18884541227371,1]
["Zona10",2029,156.18884541227371,1]
["Zona10",2030,156.18884541227371,1]
["Zona10",2031,156.18884541227371,1]
["Zona10",2032,156.18884541227371,1]
["Zona10",2033,156.18884541227371,1]
["Zona14",2023,72.716400862433318,1]
["Zona14",2024,67.035432045055714,1]
["Zona14",2025,25.568482857553761,1]
["Zona14",2026,25.568482857553761,1]
["Zona14",2027,25.568482857553761,1]
["Zona14",2028,25.568482857553761,1]
["Zona14",2029,25.568482857553761,1]
["Zona14",2030,25.568482857553761,1]
["Zona14",2031,50.568482857553761,1]
["Zona14",2032,75.177857857553761,1]
["Zona14",2033,74.003203828529479,1]
["Zona9",2023,65.05822713468288,1]
["Zona9",2024,101.85765487900851,1]
["Zona9",2025,35.15625,1]
["Zona9",2026,35.15625,1]
["Zona9",2027,34.6875,1]
["Zona9",2028,34.6875,1]
["Zona9",2029,31.30361928367072,1]
["Zona9",2030,36.9140625,1]
["Zona9",2031,56.303619283670713,1]
["Zona9",2032,56.303619283670713,1]
["Zona9",2033,56.303619283670713,1]

{"sheet":"zonaBarra","index":7,"n_rows":67,"n_cols":2,"rows_kept":67,"cut":false,"hidden":false,"merged":[]}
["nombre","barra"]
["Zona1","El Carmen 110"]
["Zona1","El Carmen 66"]
["Zona1","El Carmen 13.8"]
["Zona1","San Jacinto 66"]
["Zona2","Cartagena 66"]
["Zona2","Cospique 66"]
["Zona2","Membrillal 66"]
["Zona2","Proelectrica 66"]
["Zona2","Zaragocilla 66"]
["Zona2","Membrillal 13.8"]
["Zona3","Bayunca 66"]
["Zona3","Manzanillo 66"]
["Zona3","Bayunca 13.8"]
["Zona3","Bayunca 34.5"]
["Zona3","Manzanillo 13.8"]
["Zona4","Calamar 13.8"]
["Zona4","Calamar 34.5"]
["Zona4","San Estanisiao 13.8"]
["Zona4","San Estanislao 34.5"]
["Zona4","Calamar 66"]
["Zona5","San Jacinto 13.8"]
["Zona5","San Jacinto 34.5"]
["Zona5","San Juan Nepomuceno 13.8"]
["Zona5","San Juan Nepomuceno 34.5"]
["Zona6","Candelaria 110"]
["Zona6","Nv Cospique 110"]
["Zona6","Nv Cospique 13.8"]
["Zona6","Argos 110"]
["Zona7","Bolivar 220"]
["Zona7","Bolivar 34.5"]
["Zona8","Ternera 13.8"]
["Zona8","Ternera 2 13.8"]
["Zona8","Ternera 66"]
["Zona8","Ternera  13.8"]
["Zona9","Ternera 110"]
["Zona9","Pasacaballos 13.8"]
["Zona9","Turbaco 13.8"]
["Zona9","Pasacaballos 110"]
["Zona9","Turbaco 110"]
["Zona10","Bolivar 500"]
["Zona11","Bgrande 66"]
["Zona11","Bosque 220"]
["Zona11","Bosque 66"]
["Zona11","Chambacu 66"]
["Zona11","Campestre 66"]
["Zona11","La Marina 66"]
["Zona12","Carreto 500"]
["Zona13","Candelaria 220"]
["Zona13","Cartagena 220"]
["Zona13","Ternera 220"]
["Zona13","Candelaria 13.8"]
["Zona14","Mamonal 66"]
["Zona14","Mamonal 13.8"]
["Zona15","Zambrano 66"]
["Zona15","Plato 13.8"]
["Zona15","Plato 34.5"]
["Zona15","Zambrano 13.8"]
["Zona15","Zambrano 34.5"]
["Zona16","Nva Toluviejo 110"]
["Zona17","Bolivar 13.8"]
["Zona17","Bolivar 66"]
["Zona17","Villa Estrella 66"]
["Zona17","Villa Estrella 13.8"]
["Zona18","Carreto 66"]
["Zona19","Gambote 66"]
["Zona20","Pasacaballos 220"]

{"sheet":"calificacionProyectos","index":8,"n_rows":144,"n_cols":8,"rows_kept":144,"cut":false,"hidden":false,"merged":[]}
["nombre","BT_Confi","BT_Flex","EC_RE","EC_RP","EC_Per","EC_Mar","B_Ambiental"]
["SC_1753_A1",190981882.76379448,190522409.60674566,191190385.06746086,192043797.90827599,190165856.10077411,192043797.90827599,190522409.60674566]
["SC_1753_A2",190981882.76379448,190522409.60674566,191190385.06746086,192043797.90827599,190233028.47336236,192043797.90827599,190522409.60674566]
["SC_1754_A1",190933387.3858591,190522409.60674566,191119883.1852029,191883222.04103041,190388298.63705921,191883222.04103041,190522409.60674566]
["SC_1754_A2",190933387.3858591,190522409.60674566,191119883.1852029,191883222.04103041,190395772.70899779,191883222.04103041,190522409.60674566]
["SC_1307_A1",190851211.82121104,190522409.60674566,191000417.53239334,191611125.74811485,190218377.11516082,191611125.74811485,190522409.60674566]
["SC_1307_A2",190851211.82121104,190522409.60674566,191000417.53239334,191611125.74811485,190212580.56742275,191611125.74811485,190522409.60674566]
["SC_1607_A1",190981882.76379448,190522409.60674566,191190385.06746086,192043797.90827599,190172166.69213954,192043797.90827599,190522409.60674566]
["SC_1607_A2",190981882.76379448,190522409.60674566,191190385.06746086,192043797.90827599,190155272.17268574,192043797.90827599,190522409.60674566]
["SC_1003_A1",190981882.76379448,190522409.60674566,191190385.06746086,192043797.90827599,190288275.45835572,192043797.90827599,190522409.60674566]
["SC_1003_A2",190981882.76379448,190522409.60674566,191190385.06746086,192043797.90827599,190293053.70628205,192043797.90827599,190522409.60674566]
["SC_2068_A1",190933387.3858591,190522409.60674566,191119883.1852029,191883222.04103041,190405945.15594748,191883222.04103041,190522409.60674566]
["SC_2068_A2",190933387.3858591,190522409.60674566,191119883.1852029,191883222.04103041,190420903.89274725,191883222.04103041,190522409.60674566]
["SC_969_A1",190933387.3858591,190522409.60674566,191119883.1852029,191883222.04103041,190405945.15594748,191883222.04103041,190522409.60674566]
["SC_969_A2",190933387.3858591,190522409.60674566,191119883.1852029,191883222.04103041,190403808.19354752,191883222.04103041,190522409.60674566]
["SC_970_A1",190933387.3858591,190522409.60674566,191119883.1852029,191883222.04103041,190405945.15594748,191883222.04103041,190522409.60674566]
["SC_537_A1",197956892.25198987,191269305.38540289,177897032.73484266,187442706.26619443,190091491.09605318,187442706.26619443,190522409.60674566]
["SC_765_A1",190981882.76379448,190522409.60674566,191190385.06746086,192043797.90827599,190364689.19919354,192043797.90827599,190522409.60674566]
["SC_765_A2",190981882.76379448,190522409.60674566,191190385.06746086,192043797.90827599,190361632.31508267,192043797.90827599,190522409.60674566]
["SC_784_A1",190981882.76379448,190522409.60674566,191190385.06746086,192043797.90827599,190222752.53910401,192043797.90827599,190522409.60674566]
["SC_784_A2",190981882.76379448,190522409.60674566,191190385.06746086,192043797.90827599,190222545.8798812,192043797.90827599,190522409.60674566]
["SC_1776_A1",190933387.3858591,190522409.60674566,191119883.1852029,191883222.04103041,190237027.60641569,191883222.04103041,190522409.60674566]
["SC_1776_A2",190933387.3858591,190522409.60674566,191119883.1852029,191883222.04103041,190253522.6103102,191883222.04103041,190522409.60674566]
["SC_588_A1",190933387.3858591,190522409.60674566,191119883.1852029,191883222.04103041,190320495.75427786,191883222.04103041,190522409.60674566]
["SC_588_A2",190933387.3858591,190522409.60674566,191119883.1852029,191883222.04103041,190336451.06179664,191883222.04103041,190522409.60674566]
["SC_629_A1",190933387.3858591,190522409.60674566,191119883.1852029,191883222.04103041,190145315.25989112,191883222.04103041,190522409.60674566]
["SC_629_A2",190933387.3858591,190522409.60674566,191119883.1852029,191883222.04103041,190155357.27113283,191883222.04103041,190522409.60674566]
["SC_631_A1",190933387.3858591,190522409.60674566,191119883.1852029,191883222.04103041,190241915.04509893,191883222.04103041,190522409.60674566]
["SC_631_A2",190933387.3858591,190522409.60674566,191119883.1852029,191883222.04103041,190251902.50384164,191883222.04103041,190522409.60674566]
["SC_1705_A2",190890010.48251796,190522409.60674566,191056822.46761978,191739594.25279641,190273075.02690342,191739594.25279641,190522409.60674566]
["SC_1795_A1",190933387.3858591,190522409.60674566,191119883.18520293,191883222.04103041,190419245.3403981,191883222.04103041,190522409.60674566]
["SC_1795_A2",190933387.3858591,190522409.60674566,191119883.18520293,191883222.04103041,190494785.13230512,191883222.04103041,190522409.60674566]
["SC_960_A2",190981882.76379448,190522409.60674566,191190385.06746086,192043797.90827599,190482255.6002968,192043797.90827599,190522409.60674566]
["SC_980_A1",190981882.76379448,190522409.60674566,191190385.06746086,192043797.90827599,190454249.51273531,192043797.90827599,190522409.60674566]
["SC_980_A2",190981882.76379448,190522409.60674566,191190385.06746086,192043797.90827599,190456957.70420375,192043797.90827599,190522409.60674566]
["SC_995_A1",198834161.20412871,191357439.08728445,176407238.2639581,187079301.2720094,190039804.9876585,187079301.2720094,190522409.60674566]
["SC_1909_A1",190981882.76379448,190522409.60674566,191190385.06746086,192043797.90827599,190362217.73980686,192043797.90827599,190522409.60674566]
["SC_1909_A2",190981882.76379448,190522409.60674566,191190385.06746086,192043797.90827599,190404652.47470903,192043797.90827599,190522409.60674566]
["SC_1903_A1",190933387.3858591,190522409.60674566,191119883.1852029,191883222.04103041,190297998.10303497,191883222.04103041,190522409.60674566]
["SC_1903_A2",190933387.3858591,190522409.60674566,191119883.1852029,191883222.04103041,190252142.6296159,191883222.04103041,190522409.60674566]
["SC_1939_A1",190972877.08991632,190522409.60674566,192159617.46095863,194251332.33379653,190624289.98746797,194251332.33379653,190522409.60674566]
["SC_831_A1",191096716.13309675,190522409.60674566,191357328.16650465,192424029.35814768,397814.78970307112,192424029.35814768,195734874.19565976]
["SC_831_A2",191096716.13309675,190522409.60674566,191357328.16650465,192424029.35814768,0,192424029.35814768,195734874.19565976]
["SC_1101_A1",191036100.59632623,190522409.60674566,191269206.17182526,192223321.72785658,190406219.34104517,192223321.72785658,190522409.60674566]
["SC_1101_A2",191036100.59632623,190522409.60674566,191269206.17182526,192223321.72785658,190406219.34104517,192223321.72785658,190522409.60674566]
["SC_1123_A1",191036100.59632623,190522409.60674566,191269206.17182526,192223321.72785658,190379508.93513703,192223321.72785658,190522409.60674566]
["SC_1896_A1",190933387.3858591,190522409.60674566,191119883.18520293,191883222.04103041,190415539.34704679,191883222.04103041,190522409.60674566]
["SC_1896_A2",190933387.3858591,190522409.60674566,191119883.18520293,191883222.04103041,190395495.21729252,191883222.04103041,190522409.60674566]
["SC_1915_A2",190933387.3858591,190522409.60674566,191119883.18520293,191883222.04103041,190289429.95229232,191883222.04103041,190522409.60674566]
["SC_2003_A1",190981882.76379448,190522409.60674566,191190385.06746086,192043797.90827599,190397016.6156238,192043797.90827599,190522409.60674566]
["SC_2003_A2",190981882.76379448,190522409.60674566,191190385.06746086,192043797.90827599,190401770.852254,192043797.90827599,190522409.60674566]
["SC_1929_A1",191036100.59632623,190522409.60674566,191269206.17182526,192223321.72785658,190278009.39268604,192223321.72785658,190522409.60674566]
["SC_1963_A1",190933387.3858591,190522409.60674566,191119883.18520293,191883222.04103041,190415549.93559924,191883222.04103041,190522409.60674566]
["SC_1963_A2",190933387.3858591,190522409.60674566,191119883.18520293,191883222.04103041,190395505.80584496,191883222.04103041,190522409.60674566]
["SC_1969_A1",190933387.3858591,190522409.60674566,191119883.18520293,191883222.04103041,190415549.93559924,191883222.04103041,190522409.60674566]
["SC_1969_A2",190933387.3858591,190522409.60674566,191119883.18520293,191883222.04103041,190395505.80584496,191883222.04103041,190522409.60674566]
["SC_1975_A1",190933387.3858591,190522409.60674566,191119883.18520293,191883222.04103041,190415549.93559924,191883222.04103041,190522409.60674566]
["SC_1975_A2",190933387.3858591,190522409.60674566,191119883.18520293,191883222.04103041,190395505.80584496,191883222.04103041,190522409.60674566]
["SC_1976_A1",190933387.3858591,190522409.60674566,191119883.18520293,191883222.04103041,190415549.93559924,191883222.04103041,190522409.60674566]
["SC_1976_A2",190933387.3858591,190522409.60674566,191119883.18520293,191883222.04103041,190395505.80584496,191883222.04103041,190522409.60674566]
["SC_1801_A1",191036100.59632623,190522409.60674566,191269206.17182526,192223321.72785658,190403548.30045435,192223321.72785658,190522409.60674566]
["SC_1832_A1",190933387.3858591,190522409.60674566,191119883.18520293,191883222.04103041,190415549.93559924,191883222.04103041,190522409.60674566]
["SC_1832_A2",190933387.3858591,190522409.60674566,191119883.18520293,191883222.04103041,190395505.80584496,191883222.04103041,190522409.60674566]
["SC_1841_A1",190933387.3858591,190522409.60674566,191119883.18520293,191883222.04103041,190419245.3403981,191883222.04103041,190522409.60674566]
["SC_1841_A2",190933387.3858591,190522409.60674566,191119883.18520293,191883222.04103041,190406581.43168911,191883222.04103041,190522409.60674566]
["SC_1184_A1",190981882.76379448,190522409.60674566,191190385.06746086,192043797.90827599,190228682.94445071,192043797.90827599,190522409.60674566]
["SC_1184_A2",190981882.76379448,190522409.60674566,191190385.06746086,192043797.90827599,190211937.09676811,192043797.90827599,190522409.60674566]
["SC_2097_A1",190981882.76379448,190522409.60674566,191190385.06746086,192043797.90827599,190397016.6156238,192043797.90827599,190522409.60674566]
["SC_2097_A2",190981882.76379448,190522409.60674566,191190385.06746086,192043797.90827599,190401770.852254,192043797.90827599,190522409.60674566]
["SC_1196_A1",190933387.3858591,190522409.60674566,191119883.1852029,191883222.04103041,190423346.97501102,191883222.04103041,190522409.60674566]
["SC_1196_A2",190933387.3858591,190522409.60674566,191119883.1852029,191883222.04103041,190411076.53691041,191883222.04103041,190522409.60674566]
["SC_1209_A1",190933387.3858591,190522409.60674566,191119883.1852029,191883222.04103041,190416136.32963294,191883222.04103041,190522409.60674566]
["SC_1209_A2",190933387.3858591,190522409.60674566,191119883.1852029,191883222.04103041,190427842.60965994,191883222.04103041,190522409.60674566]
["SC_2285_A1",190981882.76379448,190522409.60674566,191190385.06746086,192043797.90827599,190479027.19749495,192043797.90827599,190522409.60674566]
["SC_1241_A1",190981882.76379448,190522409.60674566,191190385.06746086,192043797.90827599,190288275.45835572,192043797.90827599,190522409.60674566]
["SC_1241_A2",190981882.76379448,190522409.60674566,191190385.06746086,192043797.90827599,190293053.70628205,192043797.90827599,190522409.60674566]
["SC_1260_A1",190851211.82121104,190522409.60674566,191000417.53239334,191611125.74811485,190452167.65587294,191611125.74811485,190522409.60674566]
["SC_1260_A2",190851211.82121104,190522409.60674566,191000417.53239334,191611125.74811485,190442689.22394797,191611125.74811485,190522409.60674566]
["SC_1290_A2",191036100.59632623,190522409.60674566,191269206.17182526,192223321.72785658,190521074.08645025,192223321.72785658,190522409.60674566]
["SC_1428_A1",190933387.3858591,190522409.60674566,191119883.1852029,191883222.04103041,190423346.97501102,191883222.04103041,190522409.60674566]
["SC_1428_A2",190933387.3858591,190522409.60674566,191119883.1852029,191883222.04103041,190411129.4267298,191883222.04103041,190522409.60674566]
["SC_2045_A1",191036100.59632623,190522409.60674566,191269206.17182526,192223321.72785658,190483679.51817882,192223321.72785658,190522409.60674566]
["SC_2045_A2",191036100.59632623,190522409.60674566,191269206.17182526,192223321.72785658,190482343.99788344,192223321.72785658,190522409.60674566]
["SC_2047_A1",191036100.59632623,190522409.60674566,191269206.17182526,192223321.72785658,190444949.42961201,192223321.72785658,190522409.60674566]
["SC_2047_A2",191036100.59632623,190522409.60674566,191269206.17182526,192223321.72785658,190440942.86872578,192223321.72785658,190522409.60674566]
["SC_2048_A1",191036100.59632623,190522409.60674566,191269206.17182526,192223321.72785658,190390193.09750029,192223321.72785658,190522409.60674566]
["SC_2048_A2",191036100.59632623,190522409.60674566,191269206.17182526,192223321.72785658,190368157.01262605,192223321.72785658,190522409.60674566]
["SC_2009_A1",190981882.76379448,190522409.60674566,191190385.06746086,192043797.90827599,190351467.78718138,192043797.90827599,190522409.60674566]
["SC_2009_A2",190981882.76379448,190522409.60674566,191190385.06746086,192043797.90827599,190353044.60899708,192043797.90827599,190522409.60674566]
["SC_2034_A1",191036100.59632623,190522409.60674566,191269206.17182526,192223321.72785658,190456969.11227068,192223321.72785658,190522409.60674566]
["SC_2034_A2",191036100.59632623,190522409.60674566,191269206.17182526,192223321.72785658,190455633.59197527,192223321.72785658,190522409.60674566]
["SC_2099_A1",191036100.59632623,190522409.60674566,191269206.17182526,192223321.72785658,189963494.36311749,192223321.72785658,190522409.60674566]
["SC_2099_A2",191036100.59632623,190522409.60674566,191269206.17182526,192223321.72785658,189997416.57862085,192223321.72785658,190522409.60674566]
["SC_1525_A1",190933387.3858591,190522409.60674566,191119883.1852029,191883222.04103041,190422342.06844243,191883222.04103041,190522409.60674566]
["SC_1525_A2",190933387.3858591,190522409.60674566,191119883.1852029,191883222.04103041,190419168.67927849,191883222.04103041,190522409.60674566]
["SC_1945_A1",190981882.76379448,190522409.60674566,191190385.06746086,192043797.90827599,190392085.2836791,192043797.90827599,190522409.60674566]
["SC_1945_A2",190981882.76379448,190522409.60674566,191190385.06746086,192043797.90827599,190377381.42024782,192043797.90827599,190522409.60674566]
["SC_2179_A1",190890010.48251796,190522409.60674566,191056822.46761978,191739594.25279641,190567824.83628342,191739594.25279641,190522409.60674566]
["SC_2179_A2",190890010.48251796,190522409.60674566,191056822.46761978,191739594.25279641,190562810.23802194,191739594.25279641,190522409.60674566]
["SC_1521_A1",191036100.59632623,190522409.60674566,191269206.17182526,192223321.72785658,189963494.36311749,192223321.72785658,195184721.40362769]
["SC_2201_A1",190933387.3858591,190522409.60674566,191119883.1852029,191883222.04103041,190418745.56072327,191883222.04103041,190522409.60674566]
["SC_2201_A2",190933387.3858591,190522409.60674566,191119883.1852029,191883222.04103041,190415254.83264294,191883222.04103041,190522409.60674566]
["SC_2203_A1",190933387.3858591,190522409.60674566,191119883.1852029,191883222.04103041,190424071.75158137,191883222.04103041,190522409.60674566]
["SC_2203_A2",190933387.3858591,190522409.60674566,191119883.1852029,191883222.04103041,190415035.30002573,191883222.04103041,190522409.60674566]
["SC_2146_A1",190925332.22138846,190522409.60674566,191986817.34754437,193857760.88317758,190284948.12541223,193857760.88317758,190522409.60674566]
["SC_2146_A2",190925332.22138846,190522409.60674566,191986817.34754437,193857760.88317758,190329682.5603233,193857760.88317758,190522409.60674566]
["SC_2000_A1",191036100.59632623,190522409.60674566,191269206.17182526,192223321.72785658,190366394.1258361,192223321.72785658,190522409.60674566]
["SC_2000_A2",191036100.59632623,190522409.60674566,191269206.17182526,192223321.72785658,190366394.1258361,192223321.72785658,190522409.60674566]
["SC_2019_A1",190981882.76379448,190522409.60674566,191190385.06746086,192043797.90827599,190394591.47471645,192043797.90827599,190522409.60674566]
["SC_2019_A2",190981882.76379448,190522409.60674566,191190385.06746086,192043797.90827599,190388618.66480857,192043797.90827599,190522409.60674566]
["SC_2256_A1",190981882.76379448,190522409.60674566,191190385.06746086,192043797.90827599,190404386.88296545,192043797.90827599,190522409.60674566]
["SC_2256_A2",190981882.76379448,190522409.60674566,191190385.06746086,192043797.90827599,190407134.37552306,192043797.90827599,190522409.60674566]
["SC_2336_A1",190890010.48251796,190522409.60674566,191056822.46761978,191739594.25279641,190477493.73447713,191739594.25279641,190522409.60674566]
["SC_2336_A2",190890010.48251796,190522409.60674566,191056822.46761978,191739594.25279641,190473288.62063104,191739594.25279641,190522409.60674566]
["SC_2186_A1",190890010.48251796,190522409.60674566,191056822.46761978,191739594.25279641,190000134.46706155,191739594.25279641,190522409.60674566]
["SC_2186_A2",190890010.48251796,190522409.60674566,191056822.46761978,191739594.25279641,189964417.28133133,191739594.25279641,190522409.60674566]
["SC_2216_A1",191036100.59632623,190522409.60674566,191269206.17182526,192223321.72785658,190512096.71902451,192223321.72785658,190522409.60674566]
["SC_2216_A2",191036100.59632623,190522409.60674566,191269206.17182526,192223321.72785658,190511038.98695055,192223321.72785658,190522409.60674566]
["SC_2187_A1",197956892.25198987,191269305.38540289,177897032.73484266,187442706.26619443,190413583.51434994,187442706.26619443,190522409.60674566]
["SC_2187_A2",197956892.25198987,191269305.38540289,177897032.73484266,187442706.26619443,190424753.84420702,187442706.26619443,190522409.60674566]
["SC_2122_A1",190882805.50535282,190522409.60674566,191832255.5287481,193505729.17421606,190480661.90929991,193505729.17421606,190522409.60674566]
["SC_2122_A2",190882805.50535282,190522409.60674566,191832255.5287481,193505729.17421606,190495999.95692566,193505729.17421606,190522409.60674566]
["SC_1741_A1",190933387.3858591,190522409.60674566,191119883.1852029,191883222.04103041,190145410.97406837,191883222.04103041,190522409.60674566]
["SC_1741_A2",190933387.3858591,190522409.60674566,191119883.1852029,191883222.04103041,151785905.87879375,191883222.04103041,190522409.60674566]
["SC_170_A1",191036100.59632623,190522409.60674566,191269206.17182526,192223321.72785658,190360946.80565521,192223321.72785658,190522409.60674566]
["SC_170_A2",191036100.59632623,190522409.60674566,191269206.17182526,192223321.72785658,190367293.19809899,192223321.72785658,190522409.60674566]
["SC_829_A1",190706965.96786612,190522409.60674566,191193173.05862597,192050147.86780718,190474668.61302745,192050147.86780718,190522409.60674566]
["SC_829_A2",190706965.96786612,190522409.60674566,191193173.05862597,192050147.86780718,190473531.06287456,192050147.86780718,190522409.60674566]
["SC_436_A1",190933387.3858591,190522409.60674566,191119883.1852029,191883222.04103041,190242463.79266587,191883222.04103041,190522409.60674566]
["SC_436_A2",190933387.3858591,190522409.60674566,191119883.1852029,191883222.04103041,190196343.87014979,191883222.04103041,190522409.60674566]
["SC_484_A1",190933387.3858591,190522409.60674566,191119883.1852029,191883222.04103041,190073692.37896311,191883222.04103041,190522409.60674566]
["SC_501_A1",190844767.29780751,190522409.60674566,191694007.03250813,193190852.86924154,190194568.41852003,193190852.86924154,190522409.60674566]
["SC_501_A2",190844767.29780751,190522409.60674566,191694007.03250813,193190852.86924154,190166814.66713586,193190852.86924154,190522409.60674566]
["SC_545_A1",190981882.76379448,190522409.60674566,191190385.06746086,192043797.90827599,190426110.84585905,192043797.90827599,190522409.60674566]
["SC_545_A2",190981882.76379448,190522409.60674566,191190385.06746086,192043797.90827599,190421042.4900229,192043797.90827599,190522409.60674566]
["SC_1220_A1",190706965.96786612,190522409.60674566,191193173.05862597,192050147.86780718,190488708.40146527,192050147.86780718,190522409.60674566]
["SC_1220_A2",190706965.96786612,190522409.60674566,191193173.05862597,192050147.86780718,190490123.06244665,192050147.86780718,190522409.60674566]
["SC_1758_A1",190890010.48251796,190522409.60674566,191056822.46761978,191739594.25279641,190433755.2940855,191739594.25279641,190522409.60674566]
["SC_1758_A2",190890010.48251796,190522409.60674566,191056822.46761978,191739594.25279641,190423158.40719336,191739594.25279641,190522409.60674566]
["SC_1760_A1",190851211.82121104,190522409.60674566,191000417.53239334,191611125.74811485,190452252.28472942,191611125.74811485,190522409.60674566]
["SC_1760_A2",190851211.82121104,190522409.60674566,191000417.53239334,191611125.74811485,190442773.85280442,191611125.74811485,190522409.60674566]
["SC_2140_A1",199814947.89261991,191905465.84266028,174741648.04550916,186673014.48851052,190212702.45024058,186673014.48851052,190522409.60674566]
["SC_2272_A1",199814947.89261991,191905465.84266028,174741648.04550916,186673014.48851052,190956987.91087136,186673014.48851052,190522409.60674566]
["SC_2272_A2",199814947.89261991,191905465.84266028,174741648.04550916,186673014.48851052,190937889.97064704,186673014.48851052,190522409.60674566]

{"sheet":"ejecutar","index":9,"n_rows":24,"n_cols":14,"rows_kept":24,"cut":false,"hidden":false,"merged":[]}
[]
[]
[]
[]
[]
[]
[]
[null,null,null,null,null,null,null,null,null,null,null,"OPTIMIZADOR",null,"cbc"]
[]
[null,null,null,null,null,null,null,null,null,null,null,"PERIODO INICIAL",null,2023]
[]
[null,null,null,null,null,null,null,null,null,null,null,"PERIODO FINAL",null,2033]
[]
[null,null,null,null,null,null,null,null,null,null,null,"ESCALAR",null,0]
[]
[null,null,null,null,null,null,null,null,null,null,null,"TOLERANCIA ",null,9.9999999999999995E-7]
[]
[null,null,null,null,null,null,null,null,null,null,null,"TIEMPO MAXIMO",null,1000]
[]
[null,null,null,null,null,null,null,null,null,null,null,"OBRAS EN FILA 2",null,0]
[]
[null,null,null,null,null,null,null,null,null,null,null,"BOLSA",null,3]
[]
[null,null,null,null,null,null,null,null,null,null,null,"SUBAREA",null,"Bolívar"]

{"sheet":"ASIGNACION","index":10,"n_rows":4,"n_cols":28,"rows_kept":4,"cut":false,"hidden":false,"merged":[]}
[null,null,null,null,null,null,"aprobado","aprobado","aprobado","aprobado","aprobado","aprobado","aprobado","aprobado","aprobado","aprobado","aprobado","calificacion","calificacion","calificacion","calificacion","calificacion","calificacion","calificacion","calificacion","calificacion","calificacion","calificacion"]
["nombre","barra","tipo","capacidad","periodoIni","Fila",2023,2024,2025,2026,2027,2028,2029,2030,2031,2032,2033,2023,2024,2025,2026,2027,2028,2029,2030,2031,2032,2033]
["SC_831_A1","Zambrano 66","Solar FV",19.899999999999999,2023,2,0,0,0,0,0,0,0,0,0,0,0,920730774.99196959,920730774.99196959,920730774.99196959,920730774.99196959,920730774.99196959,920730774.99196959,920730774.99196959,920730774.99196959,920730774.99196959,920730774.99196959,920730774.99196959]
["SC_831_A2","Zambrano 34.5","Solar FV",19.899999999999999,2023,2,0,0,0,0,0,0,0,0,0,0,0,920332960.20226645,920332960.20226645,920332960.20226645,920332960.20226645,920332960.20226645,920332960.20226645,920332960.20226645,920332960.20226645,920332960.20226645,920332960.20226645,920332960.20226645]

{"sheet":"RESUMEN","index":11,"n_rows":3,"n_cols":13,"rows_kept":3,"cut":false,"hidden":false,"merged":[]}
[null,null,"capacidad aprobada","capacidad aprobada","capacidad aprobada","capacidad aprobada","capacidad aprobada","capacidad aprobada","capacidad aprobada","capacidad aprobada","capacidad aprobada","capacidad aprobada","capacidad aprobada"]
["tipo","Fila",2023,2024,2025,2026,2027,2028,2029,2030,2031,2032,2033]
["Solar FV",2,0,0,0,0,0,0,0,0,0,0,0]

{"sheet":"RESUMEN %","index":12,"n_rows":3,"n_cols":13,"rows_kept":3,"cut":false,"hidden":true,"merged":[]}
[null,null,"capacidad aprobada","capacidad aprobada","capacidad aprobada","capacidad aprobada","capacidad aprobada","capacidad aprobada","capacidad aprobada","capacidad aprobada","capacidad aprobada","capacidad aprobada","capacidad aprobada"]
["tipo","Fila",2023,2024,2025,2026,2027,2028,2029,2030,2031,2032,2033]
["Solar FV",2,0,0,0,0,0,0,0,0,0,0,0]

{"sheet":"EXPANSION","index":13,"n_rows":0,"n_cols":0,"rows_kept":0,"cut":false,"hidden":true,"merged":[]}

{"sheet":"BENEFICIO","index":14,"n_rows":2,"n_cols":12,"rows_kept":2,"cut":false,"hidden":true,"merged":[]}
["fila",2023,2024,2025,2026,2027,2028,2029,2030,2031,2032,2033]
[2,0,0,0,0,0,0,0,0,0,0,0]

{"sheet":"INTERCAMBIO","index":15,"n_rows":2,"n_cols":13,"rows_kept":2,"cut":false,"hidden":true,"merged":[]}
["area","fila",2023,2024,2025,2026,2027,2028,2029,2030,2031,2032,2033]
["Bolivar",2,-100,-100,-100,-100,-100,-100,-100,-100,-100,-100,-100]

{"sheet":"PORCENTAJE BARRAS","index":16,"n_rows":59,"n_cols":13,"rows_kept":59,"cut":false,"hidden":false,"merged":[]}
["barra","fila",2023,2024,2025,2026,2027,2028,2029,2030,2031,2032,2033]
["Argos 110",2,0,0,0,0,0,0,0,0,0,0,0]
["Bayunca 13.8",2,0,0,0,0,0,0,0,0,0,0,0]
["Bayunca 34.5",2,0,0,0,0,0,0,0,0,0,0,0]
["Bayunca 66",2,0,0,0,0,0,0,0,0,0,0,0]
["Bgrande 66",2,0,0,0,0,0,0,0,0,0,0,0]
["Bolivar 13.8",2,0,0,0,0,0,0,0,0,0,0,0]
["Bolivar 220",2,0,0,0,0,0,0,0,0,0,0,0]
["Bolivar 34.5",2,0,0,0,0,0,0,0,0,0,0,0]
["Bolivar 500",2,0,0,0,0,0,0,0,0,0,0,0]
["Bolivar 66",2,0,0,0,0,0,0,0,0,0,0,0]
["Bosque 220",2,0,0,0,0,0,0,0,0,0,0,0]
["Bosque 66",2,0,0,0,0,0,0,0,0,0,0,0]
["Calamar 13.8",2,0,0,0,0,0,0,0,0,0,0,0]
["Calamar 34.5",2,0,0,0,0,0,0,0,0,0,0,0]
["Calamar 66",2,0,0,0,0,0,0,0,0,0,0,0]
["Campestre 66",2,null,0,0,0,0,0,0,0,0,0,0]
["Candelaria 110",2,0,0,0,0,0,0,0,0,0,0,0]
["Candelaria 13.8",2,0,0,0,0,0,0,0,0,0,0,0]
["Candelaria 220",2,0,0,0,0,0,0,0,0,0,0,0]
["Carreto 500",2,null,null,null,0,0,0,0,0,0,0,0]
["Carreto 66",2,null,0,0,0,0,0,0,0,0,0,0]
["Cartagena 220",2,0,0,0,0,0,0,0,0,0,0,0]
["Cartagena 66",2,0,0,0,0,0,0,0,0,0,0,0]
["Chambacu 66",2,0,0,0,0,0,0,0,0,0,0,0]
["Cospique 66",2,0,0,0,0,0,0,0,0,0,0,0]
["El Carmen 110",2,0,0,0,0,0,0,0,0,0,0,0]
["Gambote 66",2,0,0,0,0,0,0,0,0,0,0,0]
["La Marina 66",2,null,0,0,0,0,0,0,0,0,0,0]
["Manzanillo 13.8",2,0,0,0,0,0,0,0,0,0,0,0]
["Manzanillo 66",2,0,0,0,0,0,0,0,0,0,0,0]
["Membrillal 13.8",2,0,0,0,0,0,0,0,0,0,0,0]
["Nv Cospique 110",2,0,0,0,0,0,0,0,0,0,0,0]
["Nva Toluviejo 110",2,null,null,0,0,0,0,0,0,0,0,0]
["Pasacaballos 110",2,null,0,0,0,0,0,0,0,0,0,0]
["Pasacaballos 13.8",2,null,0,0,0,0,0,0,0,0,0,0]
["Pasacaballos 220",2,null,null,null,0,0,0,0,0,0,0,0]
["Plato 13.8",2,0,0,0,0,0,0,0,0,0,0,0]
["Plato 34.5",2,0,0,0,0,0,0,0,0,0,0,0]
["Proelectrica 66",2,0,0,0,0,0,0,0,0,0,0,0]
["San Estanisiao 13.8",2,0,0,0,0,0,0,0,0,0,0,0]
["San Estanislao 34.5",2,0,0,0,0,0,0,0,0,0,0,0]
["San Jacinto 13.8",2,0,0,0,0,0,0,0,0,0,0,0]
["San Jacinto 34.5",2,0,0,0,0,0,0,0,0,0,0,0]
["San Jacinto 66",2,0,0,0,0,0,0,0,0,0,0,0]
["San Juan Nepomuceno 13.8",2,0,0,0,0,0,0,0,0,0,0,0]
["San Juan Nepomuceno 34.5",2,0,0,0,0,0,0,0,0,0,0,0]
["Ternera  13.8",2,0,0,0,0,0,0,0,0,0,0,0]
["Ternera 110",2,0,0,0,0,0,0,0,0,0,0,0]
["Ternera 13.8",2,0,0,0,0,0,0,0,0,0,0,0]
["Ternera 2 13.8",2,0,0,0,0,0,0,0,0,0,0,0]
["Toluviejo 220",2,0,0,0,0,0,0,0,0,0,0,0]
["Turbaco 110",2,null,0,0,0,0,0,0,0,0,0,0]
["Turbaco 13.8",2,null,0,0,0,0,0,0,0,0,0,0]
["Villa Estrella 66",2,0,0,0,0,0,0,0,0,0,0,0]
["Zambrano 13.8",2,0,0,0,0,0,0,0,0,0,0,0]
["Zambrano 34.5",2,0,0,0,0,0,0,0,0,0,0,0]
["Zambrano 66",2,0,0,0,0,0,0,0,0,0,0,0]
["Zaragocilla 66",2,0,0,0,0,0,0,0,0,0,0,0]

{"sheet":"PORCENTAJE AREAS","index":17,"n_rows":2,"n_cols":13,"rows_kept":2,"cut":false,"hidden":true,"merged":[]}
["area","fila",2023,2024,2025,2026,2027,2028,2029,2030,2031,2032,2033]
["Bolivar",2,-1.000001000001E-4,-1.000001000001E-4,-1.000001000001E-4,-1.000001000001E-4,-1.000001000001E-4,-1.000001000001E-4,-1.000001000001E-4,-1.000001000001E-4,-1.000001000001E-4,-1.000001000001E-4,-1.000001000001E-4]

{"sheet":"PORCENTAJE ZONAS","index":18,"n_rows":21,"n_cols":13,"rows_kept":21,"cut":false,"hidden":false,"merged":[]}
["zona","fila",2023,2024,2025,2026,2027,2028,2029,2030,2031,2032,2033]
["Zona1",2,0,0,0,0,0,0,0,0,0,0,0]
["Zona10",2,0,0,0,0,0,0,0,0,0,0,0]
["Zona11",2,0,0,0,0,0,0,0,0,0,0,0]
["Zona12",2,null,null,null,0,0,0,0,0,0,0,0]
["Zona13",2,0,0,0,0,0,0,0,0,0,0,0]
["Zona14",2,0,0,0,0,0,0,0,0,0,0,0]
["Zona15",2,0,0,0,0,0,0,0,0,0,0,0]
["Zona16",2,null,null,0,0,0,0,0,0,0,0,0]
["Zona17",2,0,0,0,0,0,0,0,0,0,0,0]
["Zona18",2,null,0,0,0,0,0,0,0,0,0,0]
["Zona19",2,0,0,0,0,0,0,0,0,0,0,0]
["Zona2",2,0,0,0,0,0,0,0,0,0,0,0]
["Zona20",2,null,null,null,0,0,0,0,0,0,0,0]
["Zona3",2,0,0,0,0,0,0,0,0,0,0,0]
["Zona4",2,0,0,0,0,0,0,0,0,0,0,0]
["Zona5",2,0,0,0,0,0,0,0,0,0,0,0]
["Zona6",2,0,0,0,0,0,0,0,0,0,0,0]
["Zona7",2,0,0,0,0,0,0,0,0,0,0,0]
["Zona8",2,0,0,0,0,0,0,0,0,0,0,0]
["Zona9",2,0,0,0,0,0,0,0,0,0,0,0]