{"text_format":"1","workbook":"xlsx","n_sheets":19,"sheets":["areas","barras","criterios","obras","proyectos","cortocircuito","zonas","zonaBarra","calificacionProyectos","ejecutar","ASIGNACION","RESUMEN","RESUMEN %","EXPANSION","BENEFICIO","INTERCAMBIO","PORCENTAJE BARRAS","PORCENTAJE AREAS","PORCENTAJE ZONAS"],"not_rendered":{"charts":0,"images":0,"macros":1,"external_links":1,"defined_names":6,"comments":0,"pivot_tables":0},"unopened":[],"bounds":{"document_bytes":16777216,"sheet_cells":100000,"rows_first":2000,"rows_last":500,"rows_between":2000,"halvings":0,"cell_chars":16384,"cell_head_chars":4096},"cells_cut":0,"cells_raw":0,"read":"whole","date_system":"1900"}

{"sheet":"areas","index":0,"n_rows":12,"n_cols":8,"rows_kept":12,"cut":false,"hidden":true,"merged":[]}
["nombre","periodo","limiteimportacion","limiteexportacion","demanda","generacion","factorimportacion","factorexportacion"]
["Bolivar",2023,9999999,999999,200,300,1,1]
["Bolivar",2024,9999999,999999,200,300,1,1]
["Bolivar",2025,9999999,999999,200,300,1,1]
["Bolivar",2026,9999999,999999,200,300,1,1]
["Bolivar",2027,9999999,999999,200,300,1,1]
["Bolivar",2028,9999999,999999,200,300,1,1]
["Bolivar",2029,9999999,999999,200,300,1,1]
["Bolivar",2030,9999999,999999,200,300,1,1]
["Bolivar",2031,9999999,999999,200,300,1,1]
["Bolivar",2032,9999999,999999,200,300,1,1]
["Bolivar",2033,9999999,999999,200,300,1,1]

{"sheet":"barras","index":1,"n_rows":859,"n_cols":7,"rows_kept":859,"cut":false,"hidden":false,"merged":[]}
["nombre","periodo","capacidad","cortocircuito","factorcapacidad","factorcorto","comentarios"]
["Argos 110",2023,121.2821111952575,12.962282040379851,1,1]
["Bayunca 13.8",2023,26.9140625,0.99212196415945897,1,1]
["Bayunca 34.5",2023,33.683941087596523,17.560181406834531,1,1]
["Bayunca 66",2023,104.6265789114598,16.359482161459422,1,1]
["Bgrande 66",2023,77.321769445987343,1.8544517950265309,1,1]
["Bolivar 13.8",2023,28.116811159384341,1.60547862778991,1,1]
["Bolivar 220",2023,188.90327196320101,8.3408096607946902E-2,1,1]
["Bolivar 34.5",2023,99.58984375,0.125,1,1]
["Bolivar 500",2023,856.18884541227362,23.39214033558191,1,1]
["Bolivar 66",2023,144.56947914015171,19.615988725745609,1,1]
["Bosque 220",2023,191.98929875899569,15.23384025647502,1,1]
["Bosque 3 13.8",2023,0,0.125,1,1,"No se calcula la capacidad de barra para este nodo"]
["Bosque 5 13.8",2023,0,0.125,1,1,"No se calcula la capacidad de barra para este nodo"]
["Bosque 66",2023,191.44910236717379,0.2,1,1]
["Calamar 13.8",2023,8.3684017431237123,7.5412851855361263,1,1]
["Calamar 34.5",2023,12.059966349443179,9.2509650080624901,1,1]
["Calamar 66",2023,11.91521944290615,8.1055158090277608,1,1]
["Campestre 66",2023,0,0,1,1]
["Candelaria 110",2023,123.09685681514431,22.902034463511011,1,1]
["Candelaria 13.8",2023,50,0.125,1,1]
["Candelaria 220",2023,120.20307094766341,4.5693183761875389,1,1]
["Carreto 500",2023,0,0,1,1]
["Carreto 66",2023,0,0,1,1]
["Cartagena 220",2023,112.0069696671118,0.1575,1,1]
["Cartagena 66",2023,112.68114407759199,0.1575,1,1]
["Chambacu 66",2023,113.207729626447,3.2908472052603912,1,1]
["Cospique 66",2023,63.346129873347067,0.09,1,1]
["Coveñas 110",2023,0,24.328984400176811,1,1,"No se calcula la capacidad de barra para este nodo"]
["El Carmen 110",2023,69.56126854551087,21.624264434479741,1,1]
["El Carmen 13.8",2023,0,17.200142823979299,1,1]
["El Carmen 66",2023,0,19.97274650848804,1,1]
["Gambote 66",2023,16.481656804101739,6.6625308189990884,1,1]
["La Marina 66",2023,0,0,1,1]
["Mamonal 13.8",2023,0,3.5584941484957611,1,1]
["Mamonal 66",2023,0,16.790714829664271,1,1]
["Manzanillo 13.8",2023,48.665923876436267,0.72651009320838966,1,1]
["Manzanillo 66",2023,115.32112200363829,31.986387208214719,1,1]
["Membrillal 13.8",2023,45.504140725670197,0.125,1,1]
["Membrillal 66",2023,0,2.5142185447681089,1,1]
{"$rows_left_out":820}
{"sheet":"criterios","index":2,"n_rows":8,"n_cols":2,"rows_kept":8,"cut":false,"hidden":false,"merged":[]}
["nombre","ponderacion"]
["BT_Confi",1]
["BT_Flex",1]
["EC_RE",1]
["EC_RP",0.5]
["EC_Per",1]
["EC_Mar",1]
["B_Ambiental",0.3]

{"sheet":"obras","index":3,"n_rows":1,"n_cols":13,"rows_kept":1,"cut":false,"hidden":false,"merged":[]}
["nombre","barra","zona","area","capacidadbarra","cortocircuito","capacidadzona","capacidadarea","costo","periodoini","excluyente","dependiente","obligatorio"]

{"sheet":"proyectos","index":4,"n_rows":3,"n_cols":14,"rows_kept":3,"cut":false,"hidden":false,"merged":[]}
["nombre","capacidad","tipo","barra","area","obra","excluyente","fpo","periodoIni","fpomax","fila","obligatorio","activo","ordenLlegada"]
["SC_831_A1",{"$f":"VLOOKUP($A2,'[1]Bolsa 3'!$A:$X,5,FALSE)","v":19.899999999999999},{"$f":"VLOOKUP($A2,'[1]Bolsa 3'!$A:$X,6,FALSE)","v":"Solar FV"},{"$f":"VLOOKUP($A2,'[1]Bolsa 3'!$A:$X,7,FALSE)","v":"Zambrano 66"},{"$f":"VLOOKUP($A2,'[1]Bolsa 3'!$A:$X,13,FALSE)","v":"Bolívar"},null,{"$f":"IF(RIGHT(A2,2)=\"A1\",\"\",IF(COUNTIF('[1]Bolsa 3'!A:A,VLOOKUP($A2,'[1]Bolsa 3'!$A:$X,8,FALSE)&\"_A1\")>0,VLOOKUP($A2,'[1]Bolsa 3'!$A:$X,8,FALSE)&\"_A1\",\"\"))","v":""},{"$f":"VLOOKUP($A2,'[1]Bolsa 3'!$A:$X,9,FALSE)","v":"2023-12-31"},{"$f":"YEAR(H2)","v":2023},{"$f":"H2","v":"2023-12-31"},{"$f":"VLOOKUP($A2,'[1]Bolsa 3'!$A:$X,18,FALSE)","v":2},0,1,{"$f":"VLOOKUP($A2,'[1]Bolsa 3'!$A:$X,23,FALSE)","v":56}]
["SC_831_A2",{"$f":"VLOOKUP($A3,'[1]Bolsa 3'!$A:$X,5,FALSE)","v":19.899999999999999},{"$f":"VLOOKUP($A3,'[1]Bolsa 3'!$A:$X,6,FALSE)","v":"Solar FV"},{"$f":"VLOOKUP($A3,'[1]Bolsa 3'!$A:$X,7,FALSE)","v":"Zambrano 34.5"},{"$f":"VLOOKUP($A3,'[1]Bolsa 3'!$A:$X,13,FALSE)","v":"Bolívar"},null,{"$f":"IF(RIGHT(A3,2)=\"A1\",\"\",IF(COUNTIF('[1]Bolsa 3'!A:A,VLOOKUP($A3,'[1]Bolsa 3'!$A:$X,8,FALSE)&\"_A1\")>0,VLOOKUP($A3,'[1]Bolsa 3'!$A:$X,8,FALSE)&\"_A1\",\"\"))","v":{"$error":"#VALUE!"}},{"$f":"VLOOKUP($A3,'[1]Bolsa 3'!$A:$X,9,FALSE)","v":"2023-12-31"},2023,"2023-12-31",{"$f":"VLOOKUP($A3,'[1]Bolsa 3'!$A:$X,18,FALSE)","v":2},0,1,{"$f":"VLOOKUP($A3,'[1]Bolsa 3'!$A:$X,23,FALSE)","v":57}]

{"sheet":"cortocircuito","index":5,"n_rows":3620,"n_cols":3,"rows_kept":3620,"cut":false,"hidden":false,"merged":[]}
["nombre","barra","aportecortocircuito"]
["SC_1841_A2","Argos 110",0.11]
["SC_1841_A2","Bayunca 66",0.05]
["SC_1841_A2","Bgrande 66",0.49]
["SC_1841_A2","Bolivar 220",0.28000000000000003]
["SC_1841_A2","Bolivar 500",7.0000000000000007E-2]
["SC_1841_A2","Bolivar 66",0.12]
["SC_1841_A2","Bosque 220",0.24]
["SC_1841_A2","Bosque 66",0.64]
["SC_1841_A2","Calamar 66",0.01]
["SC_1841_A2","Campestre 66",0.67]
["SC_1841_A2","Candelaria 110",0.16]
["SC_1841_A2","Candelaria 220",0.32]
["SC_1841_A2","Carreto 500",0.04]
["SC_1841_A2","Carreto 66",0.03]
["SC_1841_A2","Cartagena 220",0.31]
["SC_1841_A2","Cartagena 66",0.6]
["SC_1841_A2","Chambacu 66",0.48]
["SC_1841_A2","Cospique 66",0.53]
["SC_1841_A2","El Carmen 110",0.01]
["SC_1841_A2","El Carmen 66",0.01]
["SC_1841_A2","Gambote 66",0.09]
["SC_1841_A2","La Marina 66",0.54]
["SC_1841_A2","Mamonal 66",0.32]
["SC_1841_A2","Manzanillo 66",0.05]
["SC_1841_A2","Membrillal 66",0.47]
["SC_1841_A2","Nv Cospique 110",0.12]
["SC_1841_A2","Pasacaballos 110",0.14000000000000001]
["SC_1841_A2","Pasacaballos 220",0.09]
["SC_1841_A2","Proelectrica 66",0.56000000000000005]
["SC_1841_A2","Sabanalarga 220",0.15]
["SC_1841_A2","San Jacinto 66",0.01]
["SC_1841_A2","Ternera 110",0.09]
["SC_1841_A2","Ternera 220",0.31]
["SC_1841_A2","Ternera 66",1.05]
["SC_1841_A2","Toluviejo 110",0.05]
["SC_1841_A2","Toluviejo 220",0.03]
["SC_1841_A2","Turbaco 110",7.0000000000000007E-2]
["SC_1841_A2","Villa Estrella 66",0.04]
["SC_1841_A2","Zambrano 66",0.01]
{"$rows_left_out":3581}
{"sheet":"zonas","index":6,"n_rows":221,"n_cols":4,"rows_kept":221,"cut":false,"hidden":false,"merged":[]}
["nombre","periodo","capacidad","factor"]
["Zona6",2023,123.09685681514431,1]
["Zona6",2024,135.59685681514429,1]
["Zona6",2025,33.899214203786087,1]
["Zona6",2026,33.899214203786087,1]
["Zona6",2027,33.899214203786087,1]
["Zona6",2028,33.744527129922403,1]
["Zona6",2029,33.744527129922403,1]
["Zona6",2030,33.744527129922403,1]
["Zona6",2031,50.424410652839569,1]
["Zona6",2032,50.424410652839569,1]
["Zona6",2033,50.424410652839569,1]
["Zona2",2023,120.9837312766447,1]
["Zona2",2024,112.68114407759199,1]
["Zona2",2025,28.520413896327401,1]
["Zona2",2026,28.520413896327401,1]
["Zona2",2027,28.520413896327401,1]
["Zona2",2028,28.520413896327401,1]
["Zona2",2029,28.520413896327401,1]
["Zona2",2030,35.398023723359017,1]
["Zona2",2031,54.148023723359017,1]
["Zona2",2032,77.233731276644704,1]
["Zona2",2033,77.233731276644704,1]
["Zona8",2023,139.39482571593331,1]
["Zona8",2024,90.009912857966668,1]
["Zona8",2025,25,1]
["Zona8",2026,25,1]
["Zona8",2027,25,1]
["Zona8",2028,25,1]
["Zona8",2029,25,1]
["Zona8",2030,35.002478214491667,1]
["Zona8",2031,60.002478214491667,1]
["Zona8",2032,72.502478214491674,1]
["Zona8",2033,72.502478214491674,1]
["Zona12",2023,0,1]
["Zona12",2024,0,1]
["Zona12",2025,0,1]
["Zona12",2026,300,1]
["Zona12",2027,300,1]
["Zona12",2028,300,1]
{"$rows_left_out":182}
{"sheet":"zonaBarra","index":7,"n_rows":67,"n_cols":2,"rows_kept":67,"cut":false,"hidden":false,"merged":[]}
["nombre","barra"]
["Zona1","El Carmen 110"]
["Zona1","El Carmen 66"]
["Zona1","El Carmen 13.8"]
["Zona1","San Jacinto 66"]
["Zona2","Cartagena 66"]
["Zona2","Cospique 66"]
["Zona2","Membrillal 66"]
["Zona2","Proelectrica 66"]
["Zona2","Zaragocilla 66"]
["Zona2","Membrillal 13.8"]
["Zona3","Bayunca 66"]
["Zona3","Manzanillo 66"]
["Zona3","Bayunca 13.8"]
["Zona3","Bayunca 34.5"]
["Zona3","Manzanillo 13.8"]
["Zona4","Calamar 13.8"]
["Zona4","Calamar 34.5"]
["Zona4","San Estanisiao 13.8"]
["Zona4","San Estanislao 34.5"]
["Zona4","Calamar 66"]
["Zona5","San Jacinto 13.8"]
["Zona5","San Jacinto 34.5"]
["Zona5","San Juan Nepomuceno 13.8"]
["Zona5","San Juan Nepomuceno 34.5"]
["Zona6","Candelaria 110"]
["Zona6","Nv Cospique 110"]
["Zona6","Nv Cospique 13.8"]
["Zona6","Argos 110"]
["Zona7","Bolivar 220"]
["Zona7","Bolivar 34.5"]
["Zona8","Ternera 13.8"]
["Zona8","Ternera 2 13.8"]
["Zona8","Ternera 66"]
["Zona8","Ternera  13.8"]
["Zona9","Ternera 110"]
["Zona9","Pasacaballos 13.8"]
["Zona9","Turbaco 13.8"]
["Zona9","Pasacaballos 110"]
["Zona9","Turbaco 110"]
{"$rows_left_out":28}
{"sheet":"calificacionProyectos","index":8,"n_rows":144,"n_cols":8,"rows_kept":144,"cut":false,"hidden":false,"merged":[]}
["nombre","BT_Confi","BT_Flex","EC_RE","EC_RP","EC_Per","EC_Mar","B_Ambiental"]
["SC_1753_A1",190981882.76379448,190522409.60674566,191190385.06746086,192043797.90827599,190165856.10077411,192043797.90827599,190522409.60674566]
["SC_1753_A2",190981882.76379448,190522409.60674566,191190385.06746086,192043797.90827599,190233028.47336236,192043797.90827599,190522409.60674566]
["SC_1754_A1",190933387.3858591,190522409.60674566,191119883.1852029,191883222.04103041,190388298.63705921,191883222.04103041,190522409.60674566]
["SC_1754_A2",190933387.3858591,190522409.60674566,191119883.1852029,191883222.04103041,190395772.70899779,191883222.04103041,190522409.60674566]
["SC_1307_A1",190851211.82121104,190522409.60674566,191000417.53239334,191611125.74811485,190218377.11516082,191611125.74811485,190522409.60674566]
["SC_1307_A2",190851211.82121104,190522409.60674566,191000417.53239334,191611125.74811485,190212580.56742275,191611125.74811485,190522409.60674566]
["SC_1607_A1",190981882.76379448,190522409.60674566,191190385.06746086,192043797.90827599,190172166.69213954,192043797.90827599,190522409.60674566]
["SC_1607_A2",190981882.76379448,190522409.60674566,191190385.06746086,192043797.90827599,190155272.17268574,192043797.90827599,190522409.60674566]
["SC_1003_A1",190981882.76379448,190522409.60674566,191190385.06746086,192043797.90827599,190288275.45835572,192043797.90827599,190522409.60674566]
["SC_1003_A2",190981882.76379448,190522409.60674566,191190385.06746086,192043797.90827599,190293053.70628205,192043797.90827599,190522409.60674566]
["SC_2068_A1",190933387.3858591,190522409.60674566,191119883.1852029,191883222.04103041,190405945.15594748,191883222.04103041,190522409.60674566]
["SC_2068_A2",190933387.3858591,190522409.60674566,191119883.1852029,191883222.04103041,190420903.89274725,191883222.04103041,190522409.60674566]
["SC_969_A1",190933387.3858591,190522409.60674566,191119883.1852029,191883222.04103041,190405945.15594748,191883222.04103041,190522409.60674566]
["SC_969_A2",190933387.3858591,190522409.60674566,191119883.1852029,191883222.04103041,190403808.19354752,191883222.04103041,190522409.60674566]
["SC_970_A1",190933387.3858591,190522409.60674566,191119883.1852029,191883222.04103041,190405945.15594748,191883222.04103041,190522409.60674566]
["SC_537_A1",197956892.25198987,191269305.38540289,177897032.73484266,187442706.26619443,190091491.09605318,187442706.26619443,190522409.60674566]
["SC_765_A1",190981882.76379448,190522409.60674566,191190385.06746086,192043797.90827599,190364689.19919354,192043797.90827599,190522409.60674566]
["SC_765_A2",190981882.76379448,190522409.60674566,191190385.06746086,192043797.90827599,190361632.31508267,192043797.90827599,190522409.60674566]
["SC_784_A1",190981882.76379448,190522409.60674566,191190385.06746086,192043797.90827599,190222752.53910401,192043797.90827599,190522409.60674566]
["SC_784_A2",190981882.76379448,190522409.60674566,191190385.06746086,192043797.90827599,190222545.8798812,192043797.90827599,190522409.60674566]
["SC_1776_A1",190933387.3858591,190522409.60674566,191119883.1852029,191883222.04103041,190237027.60641569,191883222.04103041,190522409.60674566]
["SC_1776_A2",190933387.3858591,190522409.60674566,191119883.1852029,191883222.04103041,190253522.6103102,191883222.04103041,190522409.60674566]
["SC_588_A1",190933387.3858591,190522409.60674566,191119883.1852029,191883222.04103041,190320495.75427786,191883222.04103041,190522409.60674566]
["SC_588_A2",190933387.3858591,190522409.60674566,191119883.1852029,191883222.04103041,190336451.06179664,191883222.04103041,190522409.60674566]
["SC_629_A1",190933387.3858591,190522409.60674566,191119883.1852029,191883222.04103041,190145315.25989112,191883222.04103041,190522409.60674566]
["SC_629_A2",190933387.3858591,190522409.60674566,191119883.1852029,191883222.04103041,190155357.27113283,191883222.04103041,190522409.60674566]
["SC_631_A1",190933387.3858591,190522409.60674566,191119883.1852029,191883222.04103041,190241915.04509893,191883222.04103041,190522409.60674566]
["SC_631_A2",190933387.3858591,190522409.60674566,191119883.1852029,191883222.04103041,190251902.50384164,191883222.04103041,190522409.60674566]
["SC_1705_A2",190890010.48251796,190522409.60674566,191056822.46761978,191739594.25279641,190273075.02690342,191739594.25279641,190522409.60674566]
["SC_1795_A1",190933387.3858591,190522409.60674566,191119883.18520293,191883222.04103041,190419245.3403981,191883222.04103041,190522409.60674566]
["SC_1795_A2",190933387.3858591,190522409.60674566,191119883.18520293,191883222.04103041,190494785.13230512,191883222.04103041,190522409.60674566]
["SC_960_A2",190981882.76379448,190522409.60674566,191190385.06746086,192043797.90827599,190482255.6002968,192043797.90827599,190522409.60674566]
["SC_980_A1",190981882.76379448,190522409.60674566,191190385.06746086,192043797.90827599,190454249.51273531,192043797.90827599,190522409.60674566]
["SC_980_A2",190981882.76379448,190522409.60674566,191190385.06746086,192043797.90827599,190456957.70420375,192043797.90827599,190522409.60674566]
["SC_995_A1",198834161.20412871,191357439.08728445,176407238.2639581,187079301.2720094,190039804.9876585,187079301.2720094,190522409.60674566]
["SC_1909_A1",190981882.76379448,190522409.60674566,191190385.06746086,192043797.90827599,190362217.73980686,192043797.90827599,190522409.60674566]
["SC_1909_A2",190981882.76379448,190522409.60674566,191190385.06746086,192043797.90827599,190404652.47470903,192043797.90827599,190522409.60674566]
["SC_1903_A1",190933387.3858591,190522409.60674566,191119883.1852029,191883222.04103041,190297998.10303497,191883222.04103041,190522409.60674566]
["SC_1903_A2",190933387.3858591,190522409.60674566,191119883.1852029,191883222.04103041,190252142.6296159,191883222.04103041,190522409.60674566]
{"$rows_left_out":105}
{"sheet":"ejecutar","index":9,"n_rows":24,"n_cols":14,"rows_kept":24,"cut":false,"hidden":false,"merged":[]}
[]
[]
[]
[]
[]
[]
[]
[null,null,null,null,null,null,null,null,null,null,null,"OPTIMIZADOR",null,"cbc"]
[]
[null,null,null,null,null,null,null,null,null,null,null,"PERIODO INICIAL",null,2023]
[]
[null,null,null,null,null,null,null,null,null,null,null,"PERIODO FINAL",null,2033]
[]
[null,null,null,null,null,null,null,null,null,null,null,"ESCALAR",null,0]
[]
[null,null,null,null,null,null,null,null,null,null,null,"TOLERANCIA ",null,9.9999999999999995E-7]
[]
[null,null,null,null,null,null,null,null,null,null,null,"TIEMPO MAXIMO",null,1000]
[]
[null,null,null,null,null,null,null,null,null,null,null,"OBRAS EN FILA 2",null,0]
[]
[null,null,null,null,null,null,null,null,null,null,null,"BOLSA",null,3]
[]
[null,null,null,null,null,null,null,null,null,null,null,"SUBAREA",null,"Bolívar"]

{"sheet":"ASIGNACION","index":10,"n_rows":4,"n_cols":28,"rows_kept":4,"cut":false,"hidden":false,"merged":[]}
[null,null,null,null,null,null,"aprobado","aprobado","aprobado","aprobado","aprobado","aprobado","aprobado","aprobado","aprobado","aprobado","aprobado","calificacion","calificacion","calificacion","calificacion","calificacion","calificacion","calificacion","calificacion","calificacion","calificacion","calificacion"]
["nombre","barra","tipo","capacidad","periodoIni","Fila",2023,2024,2025,2026,2027,2028,2029,2030,2031,2032,2033,2023,2024,2025,2026,2027,2028,2029,2030,2031,2032,2033]
["SC_831_A1","Zambrano 66","Solar FV",19.899999999999999,2023,2,0,0,0,0,0,0,0,0,0,0,0,920730774.99196959,920730774.99196959,920730774.99196959,920730774.99196959,920730774.99196959,920730774.99196959,920730774.99196959,920730774.99196959,920730774.99196959,920730774.99196959,920730774.99196959]
["SC_831_A2","Zambrano 34.5","Solar FV",19.899999999999999,2023,2,0,0,0,0,0,0,0,0,0,0,0,920332960.20226645,920332960.20226645,920332960.20226645,920332960.20226645,920332960.20226645,920332960.20226645,920332960.20226645,920332960.20226645,920332960.20226645,920332960.20226645,920332960.20226645]

{"sheet":"RESUMEN","index":11,"n_rows":3,"n_cols":13,"rows_kept":3,"cut":false,"hidden":false,"merged":[]}
[null,null,"capacidad aprobada","capacidad aprobada","capacidad aprobada","capacidad aprobada","capacidad aprobada","capacidad aprobada","capacidad aprobada","capacidad aprobada","capacidad aprobada","capacidad aprobada","capacidad aprobada"]
["tipo","Fila",2023,2024,2025,2026,2027,2028,2029,2030,2031,2032,2033]
["Solar FV",2,0,0,0,0,0,0,0,0,0,0,0]

{"sheet":"RESUMEN %","index":12,"n_rows":3,"n_cols":13,"rows_kept":3,"cut":false,"hidden":true,"merged":[]}
[null,null,"capacidad aprobada","capacidad aprobada","capacidad aprobada","capacidad aprobada","capacidad aprobada","capacidad aprobada","capacidad aprobada","capacidad aprobada","capacidad aprobada","capacidad aprobada","capacidad aprobada"]
["tipo","Fila",2023,2024,2025,2026,2027,2028,2029,2030,2031,2032,2033]
["Solar FV",2,0,0,0,0,0,0,0,0,0,0,0]

{"sheet":"EXPANSION","index":13,"n_rows":0,"n_cols":0,"rows_kept":0,"cut":false,"hidden":true,"merged":[]}

{"sheet":"BENEFICIO","index":14,"n_rows":2,"n_cols":12,"rows_kept":2,"cut":false,"hidden":true,"merged":[]}
["fila",2023,2024,2025,2026,2027,2028,2029,2030,2031,2032,2033]
[2,0,0,0,0,0,0,0,0,0,0,0]

{"sheet":"INTERCAMBIO","index":15,"n_rows":2,"n_cols":13,"rows_kept":2,"cut":false,"hidden":true,"merged":[]}
["area","fila",2023,2024,2025,2026,2027,2028,2029,2030,2031,2032,2033]
["Bolivar",2,-100,-100,-100,-100,-100,-100,-100,-100,-100,-100,-100]

{"sheet":"PORCENTAJE BARRAS","index":16,"n_rows":59,"n_cols":13,"rows_kept":59,"cut":false,"hidden":false,"merged":[]}
["barra","fila",2023,2024,2025,2026,2027,2028,2029,2030,2031,2032,2033]
["Argos 110",2,0,0,0,0,0,0,0,0,0,0,0]
["Bayunca 13.8",2,0,0,0,0,0,0,0,0,0,0,0]
["Bayunca 34.5",2,0,0,0,0,0,0,0,0,0,0,0]
["Bayunca 66",2,0,0,0,0,0,0,0,0,0,0,0]
["Bgrande 66",2,0,0,0,0,0,0,0,0,0,0,0]
["Bolivar 13.8",2,0,0,0,0,0,0,0,0,0,0,0]
["Bolivar 220",2,0,0,0,0,0,0,0,0,0,0,0]
["Bolivar 34.5",2,0,0,0,0,0,0,0,0,0,0,0]
["Bolivar 500",2,0,0,0,0,0,0,0,0,0,0,0]
["Bolivar 66",2,0,0,0,0,0,0,0,0,0,0,0]
["Bosque 220",2,0,0,0,0,0,0,0,0,0,0,0]
["Bosque 66",2,0,0,0,0,0,0,0,0,0,0,0]
["Calamar 13.8",2,0,0,0,0,0,0,0,0,0,0,0]
["Calamar 34.5",2,0,0,0,0,0,0,0,0,0,0,0]
["Calamar 66",2,0,0,0,0,0,0,0,0,0,0,0]
["Campestre 66",2,null,0,0,0,0,0,0,0,0,0,0]
["Candelaria 110",2,0,0,0,0,0,0,0,0,0,0,0]
["Candelaria 13.8",2,0,0,0,0,0,0,0,0,0,0,0]
["Candelaria 220",2,0,0,0,0,0,0,0,0,0,0,0]
["Carreto 500",2,null,null,null,0,0,0,0,0,0,0,0]
["Carreto 66",2,null,0,0,0,0,0,0,0,0,0,0]
["Cartagena 220",2,0,0,0,0,0,0,0,0,0,0,0]
["Cartagena 66",2,0,0,0,0,0,0,0,0,0,0,0]
["Chambacu 66",2,0,0,0,0,0,0,0,0,0,0,0]
["Cospique 66",2,0,0,0,0,0,0,0,0,0,0,0]
["El Carmen 110",2,0,0,0,0,0,0,0,0,0,0,0]
["Gambote 66",2,0,0,0,0,0,0,0,0,0,0,0]
["La Marina 66",2,null,0,0,0,0,0,0,0,0,0,0]
["Manzanillo 13.8",2,0,0,0,0,0,0,0,0,0,0,0]
["Manzanillo 66",2,0,0,0,0,0,0,0,0,0,0,0]
["Membrillal 13.8",2,0,0,0,0,0,0,0,0,0,0,0]
["Nv Cospique 110",2,0,0,0,0,0,0,0,0,0,0,0]
["Nva Toluviejo 110",2,null,null,0,0,0,0,0,0,0,0,0]
["Pasacaballos 110",2,null,0,0,0,0,0,0,0,0,0,0]
["Pasacaballos 13.8",2,null,0,0,0,0,0,0,0,0,0,0]
["Pasacaballos 220",2,null,null,null,0,0,0,0,0,0,0,0]
["Plato 13.8",2,0,0,0,0,0,0,0,0,0,0,0]
["Plato 34.5",2,0,0,0,0,0,0,0,0,0,0,0]
["Proelectrica 66",2,0,0,0,0,0,0,0,0,0,0,0]
{"$rows_left_out":20}
{"sheet":"PORCENTAJE AREAS","index":17,"n_rows":2,"n_cols":13,"rows_kept":2,"cut":false,"hidden":true,"merged":[]}
["area","fila",2023,2024,2025,2026,2027,2028,2029,2030,2031,2032,2033]
["Bolivar",2,-1.000001000001E-4,-1.000001000001E-4,-1.000001000001E-4,-1.000001000001E-4,-1.000001000001E-4,-1.000001000001E-4,-1.000001000001E-4,-1.000001000001E-4,-1.000001000001E-4,-1.000001000001E-4,-1.000001000001E-4]

{"sheet":"PORCENTAJE ZONAS","index":18,"n_rows":21,"n_cols":13,"rows_kept":21,"cut":false,"hidden":false,"merged":[]}
["zona","fila",2023,2024,2025,2026,2027,2028,2029,2030,2031,2032,2033]
["Zona1",2,0,0,0,0,0,0,0,0,0,0,0]
["Zona10",2,0,0,0,0,0,0,0,0,0,0,0]
["Zona11",2,0,0,0,0,0,0,0,0,0,0,0]
["Zona12",2,null,null,null,0,0,0,0,0,0,0,0]
["Zona13",2,0,0,0,0,0,0,0,0,0,0,0]
["Zona14",2,0,0,0,0,0,0,0,0,0,0,0]
["Zona15",2,0,0,0,0,0,0,0,0,0,0,0]
["Zona16",2,null,null,0,0,0,0,0,0,0,0,0]
["Zona17",2,0,0,0,0,0,0,0,0,0,0,0]
["Zona18",2,null,0,0,0,0,0,0,0,0,0,0]
["Zona19",2,0,0,0,0,0,0,0,0,0,0,0]
["Zona2",2,0,0,0,0,0,0,0,0,0,0,0]
["Zona20",2,null,null,null,0,0,0,0,0,0,0,0]
["Zona3",2,0,0,0,0,0,0,0,0,0,0,0]
["Zona4",2,0,0,0,0,0,0,0,0,0,0,0]
["Zona5",2,0,0,0,0,0,0,0,0,0,0,0]
["Zona6",2,0,0,0,0,0,0,0,0,0,0,0]
["Zona7",2,0,0,0,0,0,0,0,0,0,0,0]
["Zona8",2,0,0,0,0,0,0,0,0,0,0,0]
["Zona9",2,0,0,0,0,0,0,0,0,0,0,0]