{"text_format":"1","workbook":"xlsx","n_sheets":13,"sheets":["General","Tablas","InfoPro","IT-TA","EC-RE","EC-RP","EC-Per","EC-Mar","EC-Mar2","BT-Flex","BT-Confi","Resumen","Casos con puntuación igual"],"not_rendered":{"charts":0,"images":0,"macros":1,"external_links":0,"defined_names":3,"comments":4,"pivot_tables":0},"unopened":[],"bounds":{"document_bytes":16777216,"sheet_cells":100000,"rows_first":2000,"rows_last":500,"rows_between":2000,"halvings":0,"cell_chars":16384,"cell_head_chars":4096},"cells_cut":0,"cells_raw":0,"read":"whole","date_system":"1900"}

{"sheet":"General","index":0,"n_rows":17,"n_cols":6,"rows_kept":17,"cut":false,"hidden":false,"merged":[[2,1,2,2],[0,1,1,5]]}
[null,"Módulo de Ingreso de Información"]
[]
[]
[]
[null,"Código",3]
[null,"Nombre","Prueba 1",null,"Permisos Ambiental obtenida","NO"]
[null,"Fecha Radicación","2022-02-08"]
[null,"Hora Radicación","12:35:00"]
{"$rows_left_out":10}
{"sheet":"Tablas","index":1,"n_rows":19,"n_cols":23,"rows_kept":19,"cut":false,"hidden":false,"merged":[]}
[null,"Tecnologia","Factor de planta","Iflex","IE-RP","Factor ENFICC","Factor emisiones","Oferta promedio","Comentarios","Area Eléctrica",null,null,null,"FPO",null,"Fecha Radicacion","Hora Radicacion",null,"Gestion Ambiental",null,"Consulta Previa",null,"Permiso Arquelogico"]
[null,"Solar FV",0.26,0,0.31905022790180565,0.15,0,83577.200000000012,"Los parámetros fueron calculados conforme a la metodología presentada en la Circular UPME 057 de 2022.","Altántico",null,"SI",null,"2023-01-01",null,"2022-01-01","00:00:00",null,"No hay avances",null,"No hay avances",null,"No hay avances"]
[null,"Eólico Onshore",0.56999999999999995,0,0.31905022790180565,0.06,0,83577.200000000012,"Los parámetros fueron calculados conforme a la metodología presentada en la Circular UPME 057 de 2022.","Bolívar",null,"NO",null,"2037-12-31",null,"2022-03-31","23:59:59",null,"EIA",null,"Resolución. No Procede",null,"Aprobado"]
[null,"Eólico Offshore",0.56999999999999995,0,0.31905022790180565,0.06,0,83577.200000000012,"Los parámetros fueron calculados conforme a la metodología presentada en la Circular UPME 057 de 2022.","Córdoba - Sucre, Chinú",null,null,null,null,null,null,null,null,"LA",null,"Resolución. Si Procede",null,"No Aplica"]
[null,"Biomasa y Residuos",0.7,0.25,0.31905022790180565,0.83,0.37,83577.200000000012,"Los parámetros fueron calculados conforme a la metodología presentada en la Circular UPME 057 de 2022.","Córdoba - Sucre, Cerromatoso",null,null,null,null,null,null,null,null,"PA",null,"Finalizada"]
[null,"Geotérmica",0.8,0.25,0.31905022790180565,0.7,0,83577.200000000012,"Los parámetros fueron calculados conforme a la metodología presentada en la Circular UPME 057 de 2022.","Guajira - Cesar - Madgalena",null,null,null,null,null,null,null,null,"No Aplica"]
[null,"PCH",0.54,0.61,0.15509303371404598,0.15,0,158280.5,"Los parámetros fueron calculados conforme a la metodología presentada en la Circular UPME 057 de 2022.","Santander"]
[null,"Termica - Ciclo abierto",0.85,0.4,-0.57617415807300276,0.83,0.95,267152.5,"Los parámetros fueron calculados conforme a la metodología presentada en la Circular UPME 057 de 2022.","Norte de Santander"]
{"$rows_left_out":12}
{"sheet":"InfoPro","index":2,"n_rows":57,"n_cols":17,"rows_kept":57,"cut":false,"hidden":false,"merged":[]}
["Código","Nombre","Fecha Radicación","Hora Radicación","Capacidad","Tipo","Barra 1","Código Asociado","FPO","FPO 2","Obligaciones","Requiere Expansión","Area Eléctrica","Permisos Ambiental obtenida","Costo Activos de Uso","Pérdidas STN"]
["SC_481_A1","DIAMANTE","2022-07-12T15:55:00",44754.663194444445,70,"Solar FV","El Rio 115","SC_481","2025-12-31","2025-12-31","NO","NO","Bogotá","NO","NA",-2.8420000000000001E-2,1]
["SC_2288_A1","PARQUE SOLAR FOTOVOLTAICO ESTEROS SOL DE 199MW","2022-07-13T16:12:00",44755.675000000003,199,"Solar FV","Suria (DelSur) 220","SC_2288","2025-12-31","2025-12-31","NO","NO","Meta - Guaviare","NO","NA",-90.1,2]
["SC_2288_A2","PARQUE SOLAR FOTOVOLTAICO ESTEROS SOL DE 199MW","2022-07-13T16:12:00",44755.675000000003,199,"Solar FV","Santa Helena 115","SC_2288","2025-12-31","2025-12-31","NO","NO","Meta - Guaviare","NO","NA",-127.8,3]
["SC_924_A1","PARQUE FOTOVOLTAICO LA SABANA","2022-07-15T16:22:00",44757.681944444441,100,"Solar FV","Noroeste 220","SC_924","2026-12-31","2026-12-31","NO","NO","Bogotá","NO","NA",-0.96,4]
["SC_924_A2","PARQUE FOTOVOLTAICO LA SABANA","2022-07-15T16:22:00",44757.681944444441,100,"Solar FV","Noroeste 115","SC_924","2026-12-31","2026-12-31","NO","NO","Bogotá","NO","NA",-0.48,5]
["SC_756_A1","PARQUE FOTOVOLTAICO BALSILLAS","2022-07-15T10:56:00",44757.455555555556,100,"Solar FV","Balsillas 115","SC_756","2025-12-31","2025-12-31","NO","NO","Bogotá","NO","NA",-3.77,6]
["SC_756_A2","PARQUE FOTOVOLTAICO BALSILLAS","2022-07-15T10:56:00",44757.455555555556,100,"Solar FV","Balsillas 220","SC_756","2025-12-31","2025-12-31","NO","NO","Bogotá","NO","NA",-3.46,7]
{"$rows_left_out":50}
{"sheet":"IT-TA","index":3,"n_rows":58,"n_cols":10,"rows_kept":58,"cut":false,"hidden":false,"merged":[]}
[null,"Codigo","Nombre","Capacidad","Licencia Ambiental obtenida","Año de entrada","P","Total",null,"Año de Referencia"]
[null,{"$f":"IF(ISBLANK(InfoPro!A2),\"\",InfoPro!A2)","v":"SC_481_A1"},{"$f":"IF(ISBLANK(InfoPro!B2),\"\",InfoPro!B2)","v":"DIAMANTE"},{"$f":"IF(ISBLANK(InfoPro!E2),\"\",InfoPro!E2)","v":70},{"$f":"IF(ISBLANK(InfoPro!N2),\"\",InfoPro!N2)","v":"NO"},{"$f":"IF(ISBLANK(InfoPro!I2),\"\",YEAR(InfoPro!I2)-$J$2)","v":2},{"$f":"IF(E2=\"SI\",100,IF(E2=\"NO\",0,\"\"))","v":0},{"$f":"IF(G2=\"\",\"\",(G2))","v":0},null,2023]
[null,{"$f":"IF(ISBLANK(InfoPro!A3),\"\",InfoPro!A3)","v":"SC_2288_A1"},{"$f":"IF(ISBLANK(InfoPro!B3),\"\",InfoPro!B3)","v":"PARQUE SOLAR FOTOVOLTAICO ESTEROS SOL DE 199MW"},{"$f":"IF(ISBLANK(InfoPro!E3),\"\",InfoPro!E3)","v":199},{"$f":"IF(ISBLANK(InfoPro!N3),\"\",InfoPro!N3)","v":"NO"},{"$f":"IF(ISBLANK(InfoPro!I3),\"\",YEAR(InfoPro!I3)-$J$2)","v":2},{"$f":"IF(E3=\"SI\",100,IF(E3=\"NO\",0,\"\"))","v":0},{"$f":"IF(G3=\"\",\"\",(G3))","v":0}]
[null,{"$f":"IF(ISBLANK(InfoPro!A4),\"\",InfoPro!A4)","v":"SC_2288_A2"},{"$f":"IF(ISBLANK(InfoPro!B4),\"\",InfoPro!B4)","v":"PARQUE SOLAR FOTOVOLTAICO ESTEROS SOL DE 199MW"},{"$f":"IF(ISBLANK(InfoPro!E4),\"\",InfoPro!E4)","v":199},{"$f":"IF(ISBLANK(InfoPro!N4),\"\",InfoPro!N4)","v":"NO"},{"$f":"IF(ISBLANK(InfoPro!I4),\"\",YEAR(InfoPro!I4)-$J$2)","v":2},0,0]
[null,{"$f":"IF(ISBLANK(InfoPro!A5),\"\",InfoPro!A5)","v":"SC_924_A1"},{"$f":"IF(ISBLANK(InfoPro!B5),\"\",InfoPro!B5)","v":"PARQUE FOTOVOLTAICO LA SABANA"},{"$f":"IF(ISBLANK(InfoPro!E5),\"\",InfoPro!E5)","v":100},{"$f":"IF(ISBLANK(InfoPro!N5),\"\",InfoPro!N5)","v":"NO"},{"$f":"IF(ISBLANK(InfoPro!I5),\"\",YEAR(InfoPro!I5)-$J$2)","v":3},0,0]
[null,{"$f":"IF(ISBLANK(InfoPro!A6),\"\",InfoPro!A6)","v":"SC_924_A2"},{"$f":"IF(ISBLANK(InfoPro!B6),\"\",InfoPro!B6)","v":"PARQUE FOTOVOLTAICO LA SABANA"},{"$f":"IF(ISBLANK(InfoPro!E6),\"\",InfoPro!E6)","v":100},{"$f":"IF(ISBLANK(InfoPro!N6),\"\",InfoPro!N6)","v":"NO"},{"$f":"IF(ISBLANK(InfoPro!I6),\"\",YEAR(InfoPro!I6)-$J$2)","v":3},0,0]
[null,{"$f":"IF(ISBLANK(InfoPro!A7),\"\",InfoPro!A7)","v":"SC_756_A1"},{"$f":"IF(ISBLANK(InfoPro!B7),\"\",InfoPro!B7)","v":"PARQUE FOTOVOLTAICO BALSILLAS"},{"$f":"IF(ISBLANK(InfoPro!E7),\"\",InfoPro!E7)","v":100},{"$f":"IF(ISBLANK(InfoPro!N7),\"\",InfoPro!N7)","v":"NO"},{"$f":"IF(ISBLANK(InfoPro!I7),\"\",YEAR(InfoPro!I7)-$J$2)","v":2},0,0]
[null,{"$f":"IF(ISBLANK(InfoPro!A8),\"\",InfoPro!A8)","v":"SC_756_A2"},{"$f":"IF(ISBLANK(InfoPro!B8),\"\",InfoPro!B8)","v":"PARQUE FOTOVOLTAICO BALSILLAS"},{"$f":"IF(ISBLANK(InfoPro!E8),\"\",InfoPro!E8)","v":100},{"$f":"IF(ISBLANK(InfoPro!N8),\"\",InfoPro!N8)","v":"NO"},{"$f":"IF(ISBLANK(InfoPro!I8),\"\",YEAR(InfoPro!I8)-$J$2)","v":2},0,0]
{"$rows_left_out":51}
{"sheet":"EC-RE","index":4,"n_rows":65,"n_cols":26,"rows_kept":65,"cut":false,"hidden":false,"merged":[]}
[]
[]
[null,"Factor emisiones sistema",0.12728300000000001,"Ton/MWh",null,"Año de Referencia",2023]
[null,"Tasa de descuento",0.11799999999999999,null,null,"Mínimo",{"$f":"MIN(Z9:Z254)","v":{"$error":"#REF!"}}]
[null,"Costo emisiones Ton",91.94,"USD/Ton"]
[null,"TRM",4070,"COP/USD"]
[null,null,null,null,null,null,null,null,null,0,1,2,3,4,5,6,7,8,9,10,11,12,13,14]
["Codigo","Nombre","capacidad","tipo","Año de entrada","FP","Factor emisiones","Produccion media/a MWh/a","Emisiones evitadas Ton/a","Flujo Descontado 0","Flujo Descontado 1","Flujo Descontado 2","Flujo Descontado 3","Flujo Descontado 4","Flujo Descontado 5","Flujo Descontado 6","Flujo Descontado 7","Flujo Descontado 8","Flujo Descontado 9","Flujo Descontado 10","Flujo Descontado 11","Flujo Descontado 12","Flujo Descontado 13","Flujo Descontado 14","VPN","(Beneficio)/kW"]
{"$rows_left_out":58}
{"sheet":"EC-RP","index":5,"n_rows":64,"n_cols":26,"rows_kept":64,"cut":false,"hidden":false,"merged":[]}
[]
[null,"Precio promedio de bolsa",192057,"COP/MWh"]
[null,"Tasa de descuento",0.11799999999999999,null,null,"Año de Referencia",null,2023]
[null,null,null,null,null,"Mínimo",null,{"$f":"MIN(Z8:Z268)","v":{"$error":"#REF!"}}]
[]
[null,null,null,null,null,null,null,null,null,0,1,2,3,4,5,6,7,8,9,10,11,12,13,14]
["Codigo","Nombre","capacidad","Tecnologia","Año de entrada","FP","Precio de oferta","Desviacion","Produccion media/a MWh/a","Flujo Descontado 0","Flujo Descontado 1","Flujo Descontado 2","Flujo Descontado 3","Flujo Descontado 4","Flujo Descontado 5","Flujo Descontado 6","Flujo Descontado 7","Flujo Descontado 8","Flujo Descontado 9","Flujo Descontado 10","Flujo Descontado 11","Flujo Descontado 12","Flujo Descontado 13","Flujo Descontado 14","VPN","Beneficio/kW"]
[{"$f":"IF(ISBLANK(InfoPro!A2),\"\",InfoPro!A2)","v":"SC_481_A1"},{"$f":"IF(ISBLANK(InfoPro!B2),\"\",InfoPro!B2)","v":"DIAMANTE"},{"$f":"IF(ISBLANK(InfoPro!E2),\"\",InfoPro!E2)","v":70},{"$f":"IF(ISBLANK(InfoPro!F2),\"\",InfoPro!F2)","v":"Solar FV"},{"$f":"IF(ISBLANK(InfoPro!I2),\"\",YEAR(InfoPro!I2)-$H$3)","v":2},{"$f":"IF(B8=\"\",\"\",VLOOKUP(D8,Tablas!$B$2:$E$13,2,FALSE))","v":0.26},{"$f":"IF(B8=\"\",\"\",VLOOKUP(D8,Tablas!$B$2:$H$13,7,FALSE))","v":83577.200000000012},{"$f":"IF(B8=\"\",\"\",($C$2-(G8))/$C$2)","v":0.56483127404885003},{"$f":"IF(C8=\"\",\"\",+C8*F8*24*365)","v":159431.99999999997},{"$f":"IF($I8=\"\",\"\",(1/(1+$C$3)^(J$6+$E8))*$I8*$C$2*$H8)","v":13836962466.197943},{"$f":"IF($I8=\"\",\"\",(1/(1+$C$3)^(K$6+$E8))*$I8*$C$2*$H8)","v":12376531722.896194},11070243043.735416,9901827409.4234505,8856732924.3501339,7921943581.7085276,7085817157.1632633,6337940212.1317215,5668998400.8333817,5070660465.8617029,4535474477.5149393,4056775024.610858,3628600200.9041677,3245617353.2237635,{"$f":"IF($I8=\"\",\"\",(1/(1+$C$3)^(X$6+$E8))*$I8*$C$2*$H8)","v":2903056666.5686612},{"$f":"IF(X8=\"\",\"\",SUM(J8:X8))","v":106497181107.12415},{"$f":"IF(C8=0,0,IF(Y8=\"\",\"\",Y8/(C8*1000)))","v":1521388.3015303449}]
{"$rows_left_out":57}
{"sheet":"EC-Per","index":6,"n_rows":64,"n_cols":23,"rows_kept":64,"cut":false,"hidden":false,"merged":[]}
[]
[null,"Precio promedio de bolsa",{"$f":"'EC-RP'!C2*1000","v":192057000},"COP/GWh"]
[null,"Tasa de descuento",0.11799999999999999,null,"Año de Referencia",2023]
[null,null,null,null,"Mínimo",{"$f":"MIN(W8:W198)","v":{"$error":"#REF!"}}]
[]
[null,null,null,null,null,null,0,1,2,3,4,5,6,7,8,9,10,11,12,13,14]
["Codigo","Nombre","capacidad","Tipo","Año de entrada","Pérdidas STN","Flujo Descontado 0","Flujo Descontado 1","Flujo Descontado 2","Flujo Descontado 3","Flujo Descontado 4","Flujo Descontado 5","Flujo Descontado 6","Flujo Descontado 7","Flujo Descontado 8","Flujo Descontado 9","Flujo Descontado 10","Flujo Descontado 11","Flujo Descontado 12","Flujo Descontado 13","Flujo Descontado 14","VPN","Beneficio/kW"]
[{"$f":"IF(ISBLANK(InfoPro!A2),\"\",InfoPro!A2)","v":"SC_481_A1"},{"$f":"IF(ISBLANK(InfoPro!B2),\"\",InfoPro!B2)","v":"DIAMANTE"},{"$f":"IF(ISBLANK(InfoPro!E2),\"\",InfoPro!E2)","v":70},{"$f":"IF(ISBLANK(InfoPro!F2),\"\",InfoPro!F2)","v":"Solar FV"},{"$f":"IF(ISBLANK(InfoPro!I2),\"\",YEAR(InfoPro!I2)-$F$3)","v":2},{"$f":"IF(ISBLANK(InfoPro!P2),\"\",InfoPro!P2)","v":-2.8420000000000001E-2},{"$f":"IF($F8=\"\",\"\",(1/(1+$C$3)^(G$6+$E8))*$F8*$C$2)","v":-4366873.4579062415},{"$f":"IF($F8=\"\",\"\",(1/(1+$C$3)^(H$6+$E8))*$F8*$C$2)","v":-3905969.1036728462},{"$f":"IF($F8=\"\",\"\",(1/(1+$C$3)^(I$6+$E8))*$F8*$C$2)","v":-3493711.1839649789},-3124965.2808273518,-2795138.8916165936,-2500124.2322152001,-2236247.0771155641,-2000220.9992089125,-1789106.4393639644,-1600274.0960321692,-1431372.1789196504,-1280297.1188905637,-1145167.3693117746,-1024299.9725507824,-916189.59977708606,{"$f":"IF(U8=\"\",\"\",SUM(G8:U8))","v":-33609957.001373686},{"$f":"IF(C8=0,0,IF(V8=\"\",\"\",V8/(C8*1000)))","v":-480.14224287676694}]
{"$rows_left_out":57}
{"sheet":"EC-Mar","index":7,"n_rows":64,"n_cols":25,"rows_kept":64,"cut":false,"hidden":false,"merged":[]}
[]
[null,"Precio promedio de bolsa",{"$f":"'EC-RP'!C2","v":192057},"COP/MWh"]
[null,"Tasa de descuento",0.11799999999999999,null,null,"Año de Referencia",2023]
[null,null,null,null,null,"Mínimo",{"$f":"MIN(Y8:Y117)","v":{"$error":"#REF!"}}]
[]
[null,null,null,null,null,null,null,null,0,1,2,3,4,5,6,7,8,9,10,11,12,13,14]
["Codigo","Nombre","capacidad","Tecnologia","Año de entrada","FP","Precio de oferta promedio","Produccion media/a MWh/a","Flujo Descontado 0","Flujo Descontado 1","Flujo Descontado 2","Flujo Descontado 3","Flujo Descontado 4","Flujo Descontado 5","Flujo Descontado 6","Flujo Descontado 7","Flujo Descontado 8","Flujo Descontado 9","Flujo Descontado 10","Flujo Descontado 11","Flujo Descontado 12","Flujo Descontado 13","Flujo Descontado 14","VPN","Beneficio/kW"]
[{"$f":"IF(ISBLANK(InfoPro!A2),\"\",InfoPro!A2)","v":"SC_481_A1"},{"$f":"IF(ISBLANK(InfoPro!B2),\"\",InfoPro!B2)","v":"DIAMANTE"},{"$f":"IF(ISBLANK(InfoPro!E2),\"\",InfoPro!E2)","v":70},{"$f":"IF(ISBLANK(InfoPro!F2),\"\",InfoPro!F2)","v":"Solar FV"},{"$f":"IF(ISBLANK(InfoPro!I2),\"\",YEAR(InfoPro!I2)-$G$3)","v":2},{"$f":"IF(B8=\"\",\"\",VLOOKUP(D8,Tablas!$B$2:$E$13,2,FALSE))","v":0.26},{"$f":"IF(B8=\"\",\"\",VLOOKUP(D8,Tablas!$B$2:$H$13,7,FALSE))","v":83577.200000000012},{"$f":"IF(C8=\"\",\"\",+C8*F8*24*365)","v":159431.99999999997},{"$f":"IF($H8=\"\",\"\",(1/(1+$C$3)^(I$6+$E8))*$H8*($C$2 - $G8))","v":13836962466.197943},{"$f":"IF($H8=\"\",\"\",(1/(1+$C$3)^(J$6+$E8))*$H8*($C$2 - $G8))","v":12376531722.896194},11070243043.735416,9901827409.4234505,8856732924.3501339,7921943581.7085276,7085817157.1632633,6337940212.1317215,5668998400.8333817,5070660465.8617029,4535474477.5149393,4056775024.610858,3628600200.9041677,3245617353.2237635,2903056666.5686612,{"$f":"IF(W8=\"\",\"\",SUM(I8:W8))","v":106497181107.12415},{"$f":"IF(C8=0,0,IF(X8=\"\",\"\",X8/(C8*1000)))","v":1521388.3015303449}]
{"$rows_left_out":57}
{"sheet":"EC-Mar2","index":8,"n_rows":118,"n_cols":8,"rows_kept":118,"cut":false,"hidden":true,"merged":[]}
[]
[null,"Precio promedio de bolsa",162532,"$/MWh"]
[null,"Tasa de descuento",0.11799999999999999]
[null,"Costo emisiones Ton",80.2,"USD/Ton"]
[null,"TRM",3600]
[]
["Codigo","Nombre","capacidad","Tipo","Costos de conexión/activos de uso - SIN","VPN","Beneficio - Costo","(Beneficio - Costo)/kW"]
[{"$f":"IF(ISBLANK(InfoPro!A2),\"\",InfoPro!A2)","v":"SC_481_A1"},{"$f":"IF(ISBLANK(InfoPro!B2),\"\",InfoPro!B2)","v":"DIAMANTE"},{"$f":"IF(ISBLANK(InfoPro!E2),\"\",InfoPro!E2)","v":70},{"$f":"IF(ISBLANK(InfoPro!F2),\"\",InfoPro!F2)","v":"Solar FV"},{"$f":"IF(ISBLANK(InfoPro!#REF!),\"\",InfoPro!#REF!)","v":{"$error":"#REF!"}},{"$f":"IF(ISBLANK(InfoPro!O2),\"\",InfoPro!O2)","v":"NA"},{"$f":"IF(F8=\"\",\"\",F8-E8)","v":{"$error":"#VALUE!"}},{"$f":"IF(G8=\"\",\"\",G8/(C8*1000))","v":{"$error":"#VALUE!"}}]
{"$rows_left_out":111}
{"sheet":"BT-Flex","index":9,"n_rows":65,"n_cols":25,"rows_kept":65,"cut":false,"hidden":false,"merged":[]}
[]
[]
[null,"CEE",67453,"COP/MWh"]
[null,"Tasa de descuento",0.11799999999999999,null,null,"Año de Referencia",2023]
[null,null,null,null,null,"Mínimo",{"$f":"MIN(Y9:Y191)","v":{"$error":"#REF!"}}]
[]
[null,null,null,null,null,null,null,null,0,1,2,3,4,5,6,7,8,9,10,11,12,13,14]
["Codigo","Nombre","capacidad","Tecnologia","Año de entrada","FP","Factor de Flexibilidad","Produccion media/a MWh/a","Flujo Descontado 0","Flujo Descontado 1","Flujo Descontado 2","Flujo Descontado 3","Flujo Descontado 4","Flujo Descontado 5","Flujo Descontado 6","Flujo Descontado 7","Flujo Descontado 8","Flujo Descontado 9","Flujo Descontado 10","Flujo Descontado 11","Flujo Descontado 12","Flujo Descontado 13","Flujo Descontado 14","VPN","Beneficio/kW"]
{"$rows_left_out":58}
{"sheet":"BT-Confi","index":10,"n_rows":65,"n_cols":25,"rows_kept":65,"cut":false,"hidden":false,"merged":[]}
[]
[null,null,null,null,null,null,null,"CR1",2033920,"COP/MWh"]
[null,"Precio promedio de bolsa",{"$f":"'EC-RP'!C2","v":192057},"COP/MWh",null,null,null,"PE",884380,"COP/MWh"]
[null,"Tasa de descuento",0.11799999999999999,null,null,"Año de Referencia",2023,"Proba",0.19,"UPME Plan de expansion"]
[null,null,null,null,null,"Mínimo",{"$f":"MIN(Y9:Y166)","v":{"$error":"#REF!"}},"CR1-PE",{"$f":"((I2-I3))","v":1149540},"COP/MWh"]
[]
[null,null,null,null,null,null,null,null,0,1,2,3,4,5,6,7,8,9,10,11,12,13,14]
["Codigo","Nombre","capacidad","Tecnologia","Año de entrada","FP","Factor ENFICC","ENFICC/a MWh/a","Flujo Descontado 0","Flujo Descontado 1","Flujo Descontado 2","Flujo Descontado 3","Flujo Descontado 4","Flujo Descontado 5","Flujo Descontado 6","Flujo Descontado 7","Flujo Descontado 8","Flujo Descontado 9","Flujo Descontado 10","Flujo Descontado 11","Flujo Descontado 12","Flujo Descontado 13","Flujo Descontado 14","VPN","Beneficio/kW"]
{"$rows_left_out":58}
{"sheet":"Resumen","index":11,"n_rows":61,"n_cols":23,"rows_kept":61,"cut":false,"hidden":false,"merged":[[2,8,2,14],[2,15,2,21]]}
["Min",{"$f":"ABS(MIN('EC-RE'!G4,'EC-RP'!H4,'EC-Per'!F4,'EC-Mar'!G4,'BT-Flex'!G5,'BT-Confi'!G5))","v":{"$error":"#REF!"}},"Año Base",2023,null,null,null,null,null,null,null,null,null,null,"Pesos",1,1,1,0.5,1,1,0.3]
[]
[null,null,null,null,null,null,null,null,"Sin normalizar",null,null,null,null,null,null,"Normalizados"]
["Codigo","Codigo Asociado","Nombre","Capacidad","Fecha Radicación","Hora Radicación","Requiere Expansión","IT_TA","BT_Confi","BT_Flex","EC_RE","EC_RP","EC_Per","EC_Mar","B_Ambiental","BT_Confi","BT_Flex","EC_RE","EC_RP","EC_Per","EC_Mar","B_Ambiental","Valoracion final "]
[{"$f":"IF(ISBLANK(InfoPro!A2),\"\",InfoPro!A2)","v":"SC_481_A1"},{"$f":"IF(ISBLANK(InfoPro!H2),\"\",InfoPro!H2)","v":"SC_481"},{"$f":"IF(ISBLANK(InfoPro!B2),\"\",InfoPro!B2)","v":"DIAMANTE"},{"$f":"IF(ISBLANK(InfoPro!E2),\"\",InfoPro!E2)","v":70},{"$f":"IF(ISBLANK(InfoPro!C2),\"\",InfoPro!C2)","v":"2022-07-12T15:55:00"},{"$f":"IF(ISBLANK(InfoPro!D2),\"\",InfoPro!D2)","v":44754.663194444445},{"$f":"IF(ISBLANK(InfoPro!L2),\"\",InfoPro!L2)","v":"NO"},{"$f":"'IT-TA'!H2","v":0},{"$f":"IFERROR('BT-Confi'!Y9,\"\")","v":459473.15704881464},{"$f":"IFERROR('BT-Flex'!Y9,\"\")","v":0},{"$f":"IFERROR('EC-RE'!Z9,\"\")","v":667975.46071520646},{"$f":"IFERROR('EC-RP'!Z8,\"\")","v":1521388.3015303449},{"$f":"IFERROR('EC-Per'!W8,\"\")","v":-480.14224287676694},{"$f":"IFERROR('EC-Mar'!Y8,\"\")","v":1521388.3015303449},{"$f":"IF(C5=\"\",\"\",(SUMIF(I5:N5,\">0\"))*(H5/100))","v":0},{"$f":"IF(C5=\"\",\"\",I5+$B$1)","v":{"$error":"#REF!"}},{"$f":"IF(D5=\"\",\"\",J5+$B$1)","v":{"$error":"#REF!"}},{"$error":"#REF!"},{"$error":"#REF!"},{"$error":"#REF!"},{"$error":"#REF!"},{"$f":"IF(I5=\"\",\"\",O5+$B$1)","v":{"$error":"#REF!"}},{"$f":"IFERROR((+$P$1*P5+$Q$1*Q5+$R$1*R5+$S$1*S5+$T$1*T5+U5*$U$1+$V$1*V5),\"\")","v":""}]
[{"$f":"IF(ISBLANK(InfoPro!A3),\"\",InfoPro!A3)","v":"SC_2288_A1"},{"$f":"IF(ISBLANK(InfoPro!H3),\"\",InfoPro!H3)","v":"SC_2288"},{"$f":"IF(ISBLANK(InfoPro!B3),\"\",InfoPro!B3)","v":"PARQUE SOLAR FOTOVOLTAICO ESTEROS SOL DE 199MW"},{"$f":"IF(ISBLANK(InfoPro!E3),\"\",InfoPro!E3)","v":199},{"$f":"IF(ISBLANK(InfoPro!C3),\"\",InfoPro!C3)","v":"2022-07-13T16:12:00"},{"$f":"IF(ISBLANK(InfoPro!D3),\"\",InfoPro!D3)","v":44755.675000000003},{"$f":"IF(ISBLANK(InfoPro!L3),\"\",InfoPro!L3)","v":"NO"},{"$f":"'IT-TA'!H3","v":0},{"$f":"IFERROR('BT-Confi'!Y10,\"\")","v":459473.15704881458},{"$f":"IFERROR('BT-Flex'!Y10,\"\")","v":0},{"$f":"IFERROR('EC-RE'!Z10,\"\")","v":667975.46071520669},{"$f":"IFERROR('EC-RP'!Z9,\"\")","v":1521388.3015303449},{"$f":"IFERROR('EC-Per'!W9,\"\")","v":-535445.90047771728},{"$f":"IFERROR('EC-Mar'!Y9,\"\")","v":1521388.3015303449},{"$f":"IF(C6=\"\",\"\",(SUMIF(I6:N6,\">0\"))*(H6/100))","v":0},{"$f":"IF(C6=\"\",\"\",I6+$B$1)","v":{"$error":"#REF!"}},{"$f":"IF(D6=\"\",\"\",J6+$B$1)","v":{"$error":"#REF!"}},{"$f":"IF(E6=\"\",\"\",K6+$B$1)","v":{"$error":"#REF!"}},{"$f":"IF(F6=\"\",\"\",L6+$B$1)","v":{"$error":"#REF!"}},{"$f":"IF(G6=\"\",\"\",M6+$B$1)","v":{"$error":"#REF!"}},{"$f":"IF(H6=\"\",\"\",N6+$B$1)","v":{"$error":"#REF!"}},{"$f":"IF(I6=\"\",\"\",O6+$B$1)","v":{"$error":"#REF!"}},{"$f":"IFERROR((+$P$1*P6+$Q$1*Q6+$R$1*R6+$S$1*S6+$T$1*T6+U6*$U$1+$V$1*V6),\"\")","v":""}]
[{"$f":"IF(ISBLANK(InfoPro!A4),\"\",InfoPro!A4)","v":"SC_2288_A2"},{"$f":"IF(ISBLANK(InfoPro!H4),\"\",InfoPro!H4)","v":"SC_2288"},{"$f":"IF(ISBLANK(InfoPro!B4),\"\",InfoPro!B4)","v":"PARQUE SOLAR FOTOVOLTAICO ESTEROS SOL DE 199MW"},{"$f":"IF(ISBLANK(InfoPro!E4),\"\",InfoPro!E4)","v":199},{"$f":"IF(ISBLANK(InfoPro!C4),\"\",InfoPro!C4)","v":"2022-07-13T16:12:00"},{"$f":"IF(ISBLANK(InfoPro!D4),\"\",InfoPro!D4)","v":44755.675000000003},{"$f":"IF(ISBLANK(InfoPro!L4),\"\",InfoPro!L4)","v":"NO"},{"$f":"'IT-TA'!H4","v":0},{"$f":"IFERROR('BT-Confi'!Y11,\"\")","v":459473.15704881458},{"$f":"IFERROR('BT-Flex'!Y11,\"\")","v":0},{"$f":"IFERROR('EC-RE'!Z11,\"\")","v":667975.46071520669},{"$f":"IFERROR('EC-RP'!Z10,\"\")","v":1521388.3015303449},{"$f":"IFERROR('EC-Per'!W10,\"\")","v":-759489.30167649558},{"$f":"IFERROR('EC-Mar'!Y10,\"\")","v":1521388.3015303449},0,{"$error":"#REF!"},{"$error":"#REF!"},{"$error":"#REF!"},{"$error":"#REF!"},{"$error":"#REF!"},{"$error":"#REF!"},{"$error":"#REF!"},""]
[{"$f":"IF(ISBLANK(InfoPro!A5),\"\",InfoPro!A5)","v":"SC_924_A1"},{"$f":"IF(ISBLANK(InfoPro!H5),\"\",InfoPro!H5)","v":"SC_924"},{"$f":"IF(ISBLANK(InfoPro!B5),\"\",InfoPro!B5)","v":"PARQUE FOTOVOLTAICO LA SABANA"},{"$f":"IF(ISBLANK(InfoPro!E5),\"\",InfoPro!E5)","v":100},{"$f":"IF(ISBLANK(InfoPro!C5),\"\",InfoPro!C5)","v":"2022-07-15T16:22:00"},{"$f":"IF(ISBLANK(InfoPro!D5),\"\",InfoPro!D5)","v":44757.681944444441},{"$f":"IF(ISBLANK(InfoPro!L5),\"\",InfoPro!L5)","v":"NO"},{"$f":"'IT-TA'!H5","v":0},{"$f":"IFERROR('BT-Confi'!Y12,\"\")","v":410977.77911342977},{"$f":"IFERROR('BT-Flex'!Y12,\"\")","v":0},{"$f":"IFERROR('EC-RE'!Z12,\"\")","v":597473.57845725096},{"$f":"IFERROR('EC-RP'!Z11,\"\")","v":1360812.4342847452},{"$f":"IFERROR('EC-Per'!W11,\"\")","v":-10154.845324640593},{"$f":"IFERROR('EC-Mar'!Y11,\"\")","v":1360812.4342847452},0,{"$error":"#REF!"},{"$error":"#REF!"},{"$error":"#REF!"},{"$error":"#REF!"},{"$error":"#REF!"},{"$error":"#REF!"},{"$error":"#REF!"},""]
{"$rows_left_out":54}
{"sheet":"Casos con puntuación igual","index":12,"n_rows":32,"n_cols":20,"rows_kept":32,"cut":false,"hidden":false,"merged":[[30,19,31,19],[1,19,2,19],[3,19,4,19],[5,19,7,19],[8,19,9,19],[10,19,11,19],[12,19,13,19],[14,19,18,19],[19,19,23,19],[24,19,25,19],[26,19,27,19],[28,19,29,19]]}
["Código","Código Asociado","Valoración","Número de casos repetidos","Nombre","Fecha Radicación","Hora Radicación","Capacidad","Tipo","Barra 1","Código Asociado","FPO","FPO 2","Obligaciones","Requiere Expansión","Area Eléctrica","Permisos Ambiental obtenida","Costo Activos de Uso","Pérdidas","Comentarios"]
["SC_1003_A1","SC_1003",1108205372.6407945,2,"Turbaco Solar I 9,9 MW","2022-07-13","13:17:00",9.9,"Solar FV","Turbaco 13,8 kV","SC_1003","2025-12-31","2025-12-31","NO","NO","Bolívar","NO",0,-1.96,"Se presenta el mismo estudio de conexión "]
["SC_1241_A1","SC_1241",1108205372.6407945,2,"Turbaco Solar II 9,9 MW","2022-07-15","11:24:00",9.9,"Solar FV","Turbaco 13,8 kV","SC_1241","2025-12-31","2025-12-31","NO","NO","Bolívar","NO",0,-1.96]
["SC_1003_A2","SC_1003",1108210150.8887208,2,"Turbaco Solar I 9,9 MW","2022-07-13","13:17:00",9.9,"Solar FV","Turbaco 110 kV","SC_1003","2025-12-31","2025-12-31","NO","NO","Bolívar","NO",0,-1.92,"Se presenta el mismo estudio de conexión "]
["SC_1241_A2","SC_1241",1108210150.8887208,2,"Turbaco Solar II 9,9 MW","2022-07-15","11:24:00",9.9,"Solar FV","Turbaco 110 kV","SC_1241","2025-12-31","2025-12-31","NO","NO","Bolívar","NO",0,-1.92]
["SC_2068_A1","SC_2068",1107963181.2773244,3,"Pétalo del Bolívar - Calamar - 9.9 MW","2022-08-02","16:03:00",9.9,"Solar FV","Calamar 34.5 kV","SC_2068","2026-12-31","2026-12-31","NO","NO","Bolívar","NO",0,-1.0900000000000001,"Se presenta el mismo estudio para los casos SC_969_A1 y SC_970_A1. Para el caso SC_2068_A1 presenta coincidencia en los datos de los casos anteriormente presentados"]
["SC_969_A1","SC_969",1107963181.2773244,3,"PROYECTO SOLAR FOTOVOLTAICO COROZOS DE 9,9 MW","2022-07-13","13:24:00",9.9,"Solar FV","Ternera 13,8kV","SC_969","2026-12-31","2026-12-31","NO","NO","Bolívar","NO",0,-1.0900000000000001]
["SC_970_A1","SC_970",1107963181.2773244,3,"PARQUE SOLAR FOTOVOLTAICO CORALITOS DE 9,9 MW","2022-07-13","13:40:00",9.9,"Solar FV","Ternera 13,8kV","SC_970","2026-12-31","2026-12-31","NO","NO","Bolívar","NO",0,-1.0900000000000001]
{"$rows_left_out":24}