{"text_format":"1","workbook":"xlsx","n_sheets":2,"sheets":["minerales","datos"],"not_rendered":{"charts":0,"images":2,"macros":1,"external_links":0,"defined_names":1,"comments":0,"pivot_tables":0},"unopened":[],"bounds":{"document_bytes":16777216,"sheet_cells":100000,"rows_first":2000,"rows_last":500,"rows_between":2000,"halvings":0,"cell_chars":16384,"cell_head_chars":4096},"cells_cut":0,"cells_raw":0,"read":"whole","date_system":"1900"}

{"sheet":"minerales","index":0,"n_rows":7,"n_cols":5,"rows_kept":7,"cut":false,"hidden":true,"merged":[]}
["IdMineral","Mineral","Unidad","Descripción","descMineral"]
[23,"Niquel","USD/t","Mid XL-NI-FRC.O LME Nickel Cash Official","NIQUEL"]
[77,"Carbón metalúrgico","US$/t","Mid-Vol FOB Colombia (Promedio Mensual)","CARBON METALURGICO"]
[78,"Carbón térmico","US$/t","FOB (API2 - BCI7) Argus media Baltic Exchange","CARBON TERMICO"]
[3,"Oro","LBMA Gold Price PM USD","US$/oz","ORO"]
[4,"Plata","LBMA Silver Price USD","US$/oz","PLATA"]
[6,"Cobre","LME Copper Cash Official USD/t. mid","XL-CA-FRC.O","COBRE"]

{"sheet":"datos","index":1,"n_rows":784,"n_cols":4,"rows_kept":784,"cut":false,"hidden":false,"merged":[[4,2,4,3],[5,2,5,3],[0,1,0,3]]}
[null,"Precios Internacionales\n de minerales"]
[]
[null,"Seleccione Mineral","Plata"]
[]
[null,"Descripción",{"$f":"VLOOKUP(C3,minerales!$B$2:$C$7,2,FALSE)","v":"LBMA Silver Price USD"}]
[null,"Unidad",{"$f":"VLOOKUP(C3,minerales!B2:D7,3,FALSE)","v":"US$/oz"}]
[]
["Mineral","Año","Mes","Precio"]
["Oro",2025,5,3277.99]
["Oro",2025,6,3352]
["Oro",2025,7,3338.31]
["Oro",2025,8,3362.99]
["Oro",2025,9,3665.2]
["Oro",2025,10,4053.28]
["Oro",2025,11,4082.95]
["Oro",2015,1,1251.8452400000001]
["Oro",2015,2,1227.1875]
["Oro",2015,3,1178.6295500000001]
["Oro",2015,4,1197.9100000000001]
["Oro",2015,5,1199.0526299999999]
["Oro",2015,6,1181.5045500000001]
["Oro",2015,7,1130.0369599999999]
["Oro",2015,8,1117.4749999999999]
["Oro",2015,9,1124.5318199999999]
["Oro",2015,10,1159.2454499999999]
["Oro",2015,11,1085.7023799999999]
["Oro",2015,12,1068.25263]
["Oro",2016,1,1097.375]
["Oro",2016,2,1199.9100000000001]
["Oro",2016,3,1246.3399999999999]
["Oro",2016,4,1242.26]
["Oro",2016,5,1259.4000000000001]
["Oro",2016,6,1276.4000000000001]
["Oro",2016,7,1337.33]
["Oro",2016,8,1341.09]
["Oro",2016,9,1326.03]
["Oro",2016,10,1266.57]
["Oro",2016,11,1235.98]
["Oro",2016,12,1151.4000000000001]
["Oro",2017,1,1192.6199999999999]
["Oro",2017,2,1234.3599999999999]
["Oro",2017,3,1231.0899999999999]
["Oro",2017,4,1265.6300000000001]
["Oro",2017,5,1245]
["Oro",2017,6,1260.26]
["Oro",2017,7,1236.22]
["Oro",2017,8,1282.32]
["Oro",2017,9,1314.98]
["Oro",2017,10,1279.51]
["Oro",2017,11,1282.28]
["Oro",2017,12,1261.26]
["Oro",2018,1,1331.67]
["Oro",2018,2,1331.53]
["Oro",2018,3,1324.66]
["Oro",2018,4,1334.74]
["Oro",2018,5,1303.03]
["Oro",2018,6,1281.57]
["Oro",2018,7,1238.53]
["Oro",2018,8,1201.25]
["Oro",2018,9,1198.47]
["Oro",2018,10,1215.3900000000001]
["Oro",2018,11,1220.95]
["Oro",2018,12,1247.92]
["Oro",2019,1,1291.75]
["Oro",2019,2,1320.07]
["Oro",2019,3,1300.9000000000001]
["Oro",2019,4,1286.45]
["Oro",2019,5,1283.95]
["Oro",2019,6,1359.04]
["Oro",2019,7,1412.98]
["Oro",2019,8,1498.8]
["Oro",2019,9,1511.31]
["Oro",2019,10,1494.8]
["Oro",2019,11,1470.02]
["Oro",2019,12,1485.63]
["Oro",2020,1,1563.37]
["Oro",2020,2,1594.66]
["Oro",2020,3,1587.73]
["Oro",2020,4,1680.03]
["Oro",2020,5,1716.38]
["Oro",2020,6,1732.22]
["Oro",2020,7,1843.31]
["Oro",2020,8,1968.57]
["Oro",2020,9,1922.21]
["Oro",2020,10,1900.28]
["Oro",2020,11,1863.49]
["Oro",2020,12,1855.96]
["Oro",2021,1,1866.99]
["Oro",2021,2,1808.18]
["Oro",2021,3,1718.23]
["Oro",2021,4,1759.76]
["Oro",2021,5,1849.74]
["Oro",2021,6,1834.12]
["Oro",2021,7,1805.5]
["Oro",2021,8,1785.23]
["Oro",2021,9,1778.4]
["Oro",2021,10,1776.4]
["Oro",2021,11,1817.89]
["Oro",2021,12,1791.92]
["Oro",2022,1,1816.63]
["Oro",2022,2,1859.79]
["Oro",2022,3,1949.73913043478]
["Oro",2022,4,1935.69047619048]
["Oro",2022,5,1846.1818181818201]
["Oro",2022,6,1834.5954545454499]
["Oro",2022,7,1733.0904761904801]
["Oro",2022,8,1762.47826086957]
["Oro",2022,9,1680.03181818182]
["Oro",2022,10,1665.8380952381001]
["Oro",2024,3,2158.0100000000002]
["Oro",2024,4,2335.4899999999998]
["Oro",2024,5,2352.14]
["Oro",2024,6,2326.33]
["Oro",2024,7,2395.31]
["Oro",2024,8,2467.9699999999998]
["Oro",2024,9,2567.12]
["Oro",2024,10,2690.08]
["Oro",2024,11,2650.68]
["Oro",2024,12,2644.07]
["Oro",2025,1,2709.69]
["Oro",2025,2,2894.72]
["Oro",2025,3,2983.25]
["Oro",2025,4,3207.48]
["Oro",2022,11,1730.31428571429]
["Oro",2022,12,1796.74166666667]
["Oro",2023,1,1898.62857142857]
["Oro",2023,2,1854.54]
["Oro",2023,3,1912.73043478261]
["Oro",2023,4,2000.4166666666699]
["Oro",2023,5,1990.2175]
["Oro",2023,6,1942.9]
["Oro",2023,7,1948.8547619047599]
["Oro",2023,8,1920.0250000000001]
["Oro",2023,9,1916.9595238095201]
["Oro",2023,10,1913.03636363636]
["Oro",2023,11,1985.27272727273]
["Oro",2023,12,2029.29]
["Oro",2024,1,2034.04]
["Oro",2024,2,2023.24]
["Niquel",2024,7,16391.956521739099]
["Niquel",2024,8,16245.9523809524]
["Niquel",2024,9,16113.333333333299]
["Niquel",2024,10,16799.5652173913]
["Niquel",2024,11,15736.9]
["Niquel",2024,12,15465.75]
["Niquel",2025,1,15373.64]
["Niquel",2025,2,15269.13]
["Niquel",2025,3,16049.29]
["Niquel",2025,4,15201.5]
["Niquel",2025,5,15317.5]
["Niquel",2025,6,14985.12]
["Niquel",2025,7,15016.52]
["Niquel",2025,8,14904.13]
["Niquel",2025,9,15097.6136363636]
["Niquel",2025,10,15075.9782608696]
["Niquel",2025,11,14685.75]
["Niquel",2024,3,17427.25]
["Niquel",2024,4,18167.857142857101]
["Niquel",2024,5,19515.833333333299]
["Niquel",2024,6,17502.25]
["Niquel",2015,1,14766.9]
["Niquel",2015,2,14531.13]
["Niquel",2015,3,13742.16]
["Niquel",2015,4,12779.75]
["Niquel",2015,5,13505]
["Niquel",2015,6,12776.59]
["Niquel",2015,7,11380.54]
["Niquel",2015,8,10338.75]
["Niquel",2015,9,9895.4500000000007]
["Niquel",2015,10,10341.36]
["Niquel",2015,11,9228.57]
["Niquel",2015,12,8688.69]
["Niquel",2016,1,8479.8799999999992]
["Niquel",2016,2,8306.43]
["Niquel",2016,3,8700.9500000000007]
["Niquel",2016,4,8849.64]
["Niquel",2016,5,8685.8799999999992]
["Niquel",2016,6,8911.7000000000007]
["Niquel",2016,7,10248.93]
["Niquel",2016,8,10350.57]
["Niquel",2016,9,10185.57]
["Niquel",2016,10,10262.26]
["Niquel",2016,11,11139.77]
["Niquel",2016,12,11009.75]
["Niquel",2017,1,9980.7099999999991]
["Niquel",2017,2,10615.63]
["Niquel",2017,3,10225.65]
["Niquel",2017,4,9664.86]
["Niquel",2017,5,9150.9500000000007]
["Niquel",2017,6,8927.61]
["Niquel",2017,7,9478.69]
["Niquel",2017,8,10848.52]
["Niquel",2017,9,11230.36]
["Niquel",2017,10,11319.66]
["Niquel",2017,11,11989.89]
["Niquel",2017,12,11405.66]
["Niquel",2018,1,12876.02]
["Niquel",2018,2,13572.75]
["Niquel",2018,3,13399.76]
["Niquel",2018,4,13930.75]
["Niquel",2018,5,14351.67]
["Niquel",2018,6,15107.02]
["Niquel",2018,7,13767.73]
["Niquel",2018,8,13429.2]
["Niquel",2018,9,12523.88]
["Niquel",2018,10,12323.15]
["Niquel",2018,11,11249.2]
["Niquel",2018,12,10833.29]
["Niquel",2019,1,11451.93]
["Niquel",2019,2,12646.5]
["Niquel",2019,3,13056.31]
["Niquel",2019,4,12815.13]
["Niquel",2019,5,11995.12]
["Niquel",2019,6,11967.25]
["Niquel",2019,7,13458.59]
["Niquel",2019,8,15677.98]
["Niquel",2019,9,17668.099999999999]
["Niquel",2019,10,17107.61]
["Niquel",2019,11,15195.24]
["Niquel",2019,12,13868.83]
["Niquel",2020,1,13553.2]
["Niquel",2020,2,12743.43]
["Niquel",2020,3,11900.64]
["Niquel",2020,4,11753.2]
["Niquel",2020,5,12135.32]
["Niquel",2020,6,12703.27]
["Niquel",2020,7,13341.35]
["Niquel",2020,8,14486.85]
["Niquel",2020,9,14466.27]
["Niquel",2020,10,15219.36]
["Niquel",2020,11,15796.05]
["Niquel",2020,12,16807.05]
["Niquel",2021,1,17847.599999999999]
["Niquel",2021,2,18568.05]
["Niquel",2021,3,16460.740000000002]
["Niquel",2021,4,16480.7]
["Niquel",2021,5,17605.740000000002]
["Niquel",2021,6,17943.23]
["Niquel",2021,7,18817.05]
["Niquel",2021,8,19160.43]
["Niquel",2021,9,19393.86]
["Niquel",2021,10,19416.189999999999]
["Niquel",2021,11,19957.95]
["Niquel",2021,12,20084.57]
["Niquel",2022,1,22252.38]
["Niquel",2022,2,24172.5]
["Niquel",2022,3,36420.652173912997]
["Niquel",2022,4,33281.309523809497]
["Niquel",2022,5,28142.5]
["Niquel",2022,6,25995.7954545455]
["Niquel",2022,7,21470.9523809524]
["Niquel",2022,8,21966.956521739099]
["Niquel",2022,9,22672.840909090901]
["Niquel",2022,10,21924.523809523798]
["Niquel",2022,11,25246.25]
["Niquel",2022,12,28838.375]
["Niquel",2023,1,28226.071428571398]
["Niquel",2023,2,26678.875]
["Niquel",2023,3,23289.456521739099]
["Niquel",2023,4,23749.166666666701]
["Niquel",2023,5,22214.875]
["Niquel",2023,6,21184.090909090901]
["Niquel",2023,7,20889.880952381001]
["Niquel",2023,8,20484.431818181802]
["Niquel",2023,9,19620.5952380952]
["Niquel",2023,10,18249.2045454545]
["Niquel",2023,11,16974.318181818198]
["Niquel",2023,12,16381.71]
["Niquel",2024,1,16085.11]
["Niquel",2024,2,16303.1]
["Plata",2025,5,32.700000000000003]
["Plata",2025,6,35.94]
["Plata",2025,7,37.67]
["Plata",2025,8,37.935000000000002]
["Plata",2025,9,42.54]
["Plata",2025,10,49.433]
["Plata",2025,11,50.728000000000002]
["Plata",2015,1,17.098095199999999]
["Plata",2015,2,16.842500000000001]
["Plata",2015,3,16.222272700000001]
["Plata",2015,4,16.318999999999999]
["Plata",2015,5,16.800526300000001]
["Plata",2015,6,16.0963636]
["Plata",2015,7,15.072173899999999]
["Plata",2015,8,14.9375]
["Plata",2015,9,14.7181818]
["Plata",2015,10,15.706818200000001]
["Plata",2015,11,14.5066667]
["Plata",2015,12,14.0538095]
["Plata",2016,1,14.015750000000001]
["Plata",2016,2,15.068099999999999]
["Plata",2016,3,15.420500000000001]
["Plata",2016,4,16.258800000000001]
["Plata",2016,5,16.8888]
["Plata",2016,6,17.181100000000001]
["Plata",2016,7,19.928599999999999]
["Plata",2016,8,19.6402]
["Plata",2016,9,19.284800000000001]
["Plata",2016,10,17.737100000000002]
["Plata",2016,11,17.415500000000002]
["Plata",2016,12,16.378499999999999]
["Plata",2017,1,16.807600000000001]
["Plata",2017,2,17.874300000000002]
["Plata",2017,3,17.587800000000001]
["Plata",2017,4,18.058299999999999]
["Plata",2017,5,16.764800000000001]
["Plata",2017,6,16.945900000000002]
["Plata",2017,7,16.143799999999999]
["Plata",2017,8,16.909099999999999]
["Plata",2017,9,17.448599999999999]
["Plata",2017,10,16.9373]
["Plata",2017,11,17.004999999999999]
["Plata",2017,12,16.160799999999998]
["Plata",2018,1,17.168399999999998]
["Plata",2018,2,16.659300000000002]
["Plata",2018,3,16.470500000000001]
["Plata",2018,4,16.608499999999999]
["Plata",2018,5,16.468299999999999]
["Plata",2018,6,16.523299999999999]
["Plata",2018,7,15.71]
["Plata",2018,8,15.005000000000001]
["Plata",2018,9,14.263]
["Plata",2018,10,14.5837]
["Plata",2018,11,14.3668]
["Plata",2018,12,14.6953]
["Plata",2019,1,15.590199999999999]
["Plata",2019,2,15.8063]
["Plata",2019,3,15.3207]
["Plata",2019,4,15.042]
["Plata",2019,5,14.625500000000001]
["Plata",2019,6,14.995799999999999]
["Plata",2019,7,15.745200000000001]
["Plata",2019,8,17.137899999999998]
["Plata",2019,9,18.170000000000002]
["Plata",2019,10,17.624600000000001]
["Plata",2019,11,17.179500000000001]
["Plata",2019,12,17.1143]
["Plata",2020,1,17.965]
["Plata",2020,2,17.922000000000001]
["Plata",2020,3,14.918200000000001]
["Plata",2020,4,15.0345]
["Plata",2020,5,16.232399999999998]
["Plata",2020,6,17.719799999999999]
["Plata",2020,7,20.405000000000001]
["Plata",2020,8,26.892499999999998]
["Plata",2020,9,25.886099999999999]
["Plata",2020,10,24.24]
["Plata",2020,11,24.04]
["Plata",2020,12,24.89]
["Plata",2021,1,25.9]
["Plata",2021,2,27.32]
["Plata",2021,3,25.68]
["Plata",2021,4,25.71]
["Plata",2021,5,27.57]
["Plata",2021,6,27.05]
["Plata",2021,7,25.7]
["Plata",2021,8,23.96]
["Plata",2021,9,23.25]
["Plata",2021,10,23.41]
["Plata",2021,11,24.15]
["Plata",2021,12,22.51]
["Plata",2022,1,23.17]
["Plata",2022,2,23.56]
["Plata",2022,3,22.1279452173913]
["Plata",2022,4,17.461040476190501]
["Plata",2022,5,15.8752872727273]
["Plata",2022,6,21.493045454545499]
["Plata",2022,7,18.9585714285714]
["Plata",2022,8,19.592217391304299]
["Plata",2022,9,18.741590909090899]
["Plata",2022,10,19.361380952380902]
["Plata",2022,11,20.998863636363598]
["Plata",2022,12,23.242000000000001]
["Plata",2023,1,23.7480952380952]
["Plata",2023,2,22.009499999999999]
["Plata",2023,3,21.916521739130399]
["Plata",2023,4,24.996111111111102]
["Plata",2023,5,24.146750000000001]
["Plata",2023,6,23.4084090909091]
["Plata",2023,7,24.040952380952401]
["Plata",2023,8,23.438636363636402]
["Plata",2023,9,23.238571428571401]
["Plata",2023,10,22.321590909090901]
["Plata",2023,11,23.3897727272727]
["Plata",2023,12,23.99]
["Plata",2024,1,22.95]
["Plata",2024,2,22.69]
["Plata",2024,3,24.446999999999999]
["Plata",2024,4,27.582999999999998]
["Plata",2024,5,29.401]
["Plata",2024,6,29.585000000000001]
["Plata",2024,7,29.745000000000001]
["Plata",2024,8,28.518999999999998]
["Plata",2024,9,30.007999999999999]
["Plata",2024,10,32.414000000000001]
["Plata",2024,11,31.135000000000002]
["Plata",2024,12,30.46]
["Plata",2025,1,30.367000000000001]
["Plata",2025,2,32.183]
["Plata",2025,3,33.183]
{"$rows_left_out":384}